2.3.0 test-app throws AssumptionViolatedException

classic Classic list List threaded Threaded
9 messages Options
Reply | Threaded
Open this post in threaded view
|

2.3.0 test-app throws AssumptionViolatedException

Amit Kapit
Hi There,

Just upgraded to 2.3.0. The app seem to run okay. But when running my test it seems like AssumptionViolatedException class is missing. From IntelliJ I can see that this class exists as part of grails-2.3.0 module. Anyone has an idea how to solve this? Running dependency-report showed junit-4.11 and no conflicts.

Thanks a lot

Amit.


| Loading Grails 2.3.0
| Configuring classpath
| Configuring classpath.
| Environment set to test
| Environment set to test.
| Environment set to test..
| Environment set to test...
| Environment set to test....
| Environment set to test.....
    [mkdir] Created dir: /Users/amit/git/myapp/target/test-reports/html
    [mkdir] Created dir: /Users/amit/git/myapp/target/test-reports/plain
| Error Fatal error running tests: org/junit/internal/AssumptionViolatedException
java.lang.NoClassDefFoundError: org/junit/internal/AssumptionViolatedException
        at org.codehaus.groovy.grails.test.spock.GrailsSpecTestType.createSuite(GrailsSpecTestType.groovy:80)
        at sun.reflect.NativeMethodAccessorImpl.invoke0(Native Method)
        at sun.reflect.NativeMethodAccessorImpl.invoke(NativeMethodAccessorImpl.java:39)
        at sun.reflect.DelegatingMethodAccessorImpl.invoke(DelegatingMethodAccessorImpl.java:25)
        at java.lang.reflect.Method.invoke(Method.java:597)
        at org.codehaus.groovy.runtime.callsite.PogoMetaMethodSite$PogoCachedMethodSiteNoUnwrapNoCoerce.invoke(PogoMetaMethodSite.java:272)
        at org.codehaus.groovy.runtime.callsite.PogoMetaMethodSite.callCurrent(PogoMetaMethodSite.java:52)
        at org.codehaus.groovy.runtime.callsite.CallSiteArray.defaultCallCurrent(CallSiteArray.java:49)
        at org.codehaus.groovy.runtime.callsite.AbstractCallSite.callCurrent(AbstractCallSite.java:133)
        at org.codehaus.groovy.runtime.callsite.AbstractCallSite.callCurrent(AbstractCallSite.java:141)
        at org.codehaus.groovy.grails.test.spock.GrailsSpecTestType.doPrepare(GrailsSpecTestType.groovy:65)
        at org.codehaus.groovy.grails.test.support.GrailsTestTypeSupport.prepare(GrailsTestTypeSupport.groovy:98)
        at org.codehaus.groovy.grails.test.runner.GrailsProjectTestRunner.runTests(GrailsProjectTestRunner.groovy:389)
        at org.codehaus.groovy.grails.test.runner.GrailsProjectTestRunner.processTests(GrailsProjectTestRunner.groovy:381)
        at sun.reflect.NativeMethodAccessorImpl.invoke0(Native Method)
        at sun.reflect.NativeMethodAccessorImpl.invoke(NativeMethodAccessorImpl.java:39)
        at sun.reflect.DelegatingMethodAccessorImpl.invoke(DelegatingMethodAccessorImpl.java:25)
        at java.lang.reflect.Method.invoke(Method.java:597)
        at org.codehaus.groovy.reflection.CachedMethod.invoke(CachedMethod.java:90)
        at groovy.lang.MetaMethod.doMethodInvoke(MetaMethod.java:233)
        at groovy.lang.MetaClassImpl.invokeMethod(MetaClassImpl.java:1085)
        at groovy.lang.ExpandoMetaClass.invokeMethod(ExpandoMetaClass.java:1110)
        at groovy.lang.MetaClassImpl.invokeMethod(MetaClassImpl.java:909)
        at groovy.lang.MetaClassImpl.invokeMethod(MetaClassImpl.java:1030)
        at groovy.lang.ExpandoMetaClass.invokeMethod(ExpandoMetaClass.java:1110)
        at groovy.lang.MetaClassImpl.invokeMethod(MetaClassImpl.java:909)
        at org.codehaus.groovy.runtime.callsite.PogoMetaClassSite.callCurrent(PogoMetaClassSite.java:66)
        at org.codehaus.groovy.runtime.callsite.CallSiteArray.defaultCallCurrent(CallSiteArray.java:49)
        at org.codehaus.groovy.runtime.callsite.AbstractCallSite.callCurrent(AbstractCallSite.java:133)
        at org.codehaus.groovy.runtime.callsite.AbstractCallSite.callCurrent(AbstractCallSite.java:141)
        at org.codehaus.groovy.grails.test.runner.GrailsProjectTestRunner$_runAllTests_closure7.doCall(GrailsProjectTestRunner.groovy:300)
        at sun.reflect.NativeMethodAccessorImpl.invoke0(Native Method)
        at sun.reflect.NativeMethodAccessorImpl.invoke(NativeMethodAccessorImpl.java:39)
        at sun.reflect.DelegatingMethodAccessorImpl.invoke(DelegatingMethodAccessorImpl.java:25)
        at java.lang.reflect.Method.invoke(Method.java:597)
        at org.codehaus.groovy.reflection.CachedMethod.invoke(CachedMethod.java:90)
        at groovy.lang.MetaMethod.doMethodInvoke(MetaMethod.java:233)
        at groovy.lang.MetaClassImpl.invokeMethod(MetaClassImpl.java:1085)
        at groovy.lang.ExpandoMetaClass.invokeMethod(ExpandoMetaClass.java:1110)
        at groovy.lang.MetaClassImpl.invokeMethod(MetaClassImpl.java:909)
        at groovy.lang.Closure.call(Closure.java:411)
        at org.codehaus.groovy.runtime.DefaultGroovyMethods.callClosureForMapEntry(DefaultGroovyMethods.java:3873)
        at org.codehaus.groovy.runtime.DefaultGroovyMethods.each(DefaultGroovyMethods.java:1354)
        at org.codehaus.groovy.runtime.dgm$149.invoke(Unknown Source)
        at org.codehaus.groovy.runtime.callsite.PojoMetaMethodSite$PojoMetaMethodSiteNoUnwrapNoCoerce.invoke(PojoMetaMethodSite.java:271)
        at org.codehaus.groovy.runtime.callsite.PojoMetaMethodSite.call(PojoMetaMethodSite.java:53)
        at org.codehaus.groovy.runtime.callsite.CallSiteArray.defaultCall(CallSiteArray.java:45)
        at org.codehaus.groovy.runtime.callsite.AbstractCallSite.call(AbstractCallSite.java:108)
        at org.codehaus.groovy.runtime.callsite.AbstractCallSite.call(AbstractCallSite.java:116)
        at org.codehaus.groovy.grails.test.runner.GrailsProjectTestRunner.runAllTests(GrailsProjectTestRunner.groovy:286)
        at org.codehaus.groovy.grails.test.runner.GrailsProjectTestRunner.runAllTests(GrailsProjectTestRunner.groovy:204)
        at org.codehaus.groovy.grails.test.runner.GrailsProjectTestRunner$runAllTests.call(Unknown Source)
        at org.codehaus.groovy.runtime.callsite.CallSiteArray.defaultCall(CallSiteArray.java:45)
        at org.codehaus.groovy.runtime.callsite.AbstractCallSite.call(AbstractCallSite.java:108)
        at org.codehaus.groovy.runtime.callsite.AbstractCallSite.call(AbstractCallSite.java:120)
        at _GrailsTest_groovy$_run_closure1.doCall(_GrailsTest_groovy:95)
        at sun.reflect.NativeMethodAccessorImpl.invoke0(Native Method)
        at sun.reflect.NativeMethodAccessorImpl.invoke(NativeMethodAccessorImpl.java:39)
        at sun.reflect.DelegatingMethodAccessorImpl.invoke(DelegatingMethodAccessorImpl.java:25)
        at java.lang.reflect.Method.invoke(Method.java:597)
        at org.codehaus.groovy.reflection.CachedMethod.invoke(CachedMethod.java:90)
        at groovy.lang.MetaMethod.doMethodInvoke(MetaMethod.java:233)
        at groovy.lang.MetaClassImpl.invokeMethod(MetaClassImpl.java:1085)
        at groovy.lang.ExpandoMetaClass.invokeMethod(ExpandoMetaClass.java:1110)
        at groovy.lang.MetaClassImpl.invokeMethod(MetaClassImpl.java:909)
        at groovy.lang.DelegatingMetaClass.invokeMethod(DelegatingMetaClass.java:149)
        at org.codehaus.gant.GantMetaClass.invokeMethod(GantMetaClass.java:133)
        at org.codehaus.groovy.runtime.callsite.PogoMetaClassSite.call(PogoMetaClassSite.java:39)
        at org.codehaus.groovy.runtime.callsite.CallSiteArray.defaultCall(CallSiteArray.java:45)
        at org.codehaus.groovy.runtime.callsite.PogoMetaClassSite.call(PogoMetaClassSite.java:54)
        at org.codehaus.groovy.runtime.callsite.AbstractCallSite.call(AbstractCallSite.java:116)
        at org.codehaus.gant.GantBinding$_initializeGantBinding_closure5_closure16_closure18.doCall(GantBinding.groovy:185)
        at sun.reflect.NativeMethodAccessorImpl.invoke0(Native Method)
        at sun.reflect.NativeMethodAccessorImpl.invoke(NativeMethodAccessorImpl.java:39)
        at sun.reflect.DelegatingMethodAccessorImpl.invoke(DelegatingMethodAccessorImpl.java:25)
        at java.lang.reflect.Method.invoke(Method.java:597)
        at org.codehaus.groovy.runtime.callsite.PogoMetaMethodSite$PogoCachedMethodSite.invoke(PogoMetaMethodSite.java:231)
        at org.codehaus.groovy.runtime.callsite.PogoMetaMethodSite.callCurrent(PogoMetaMethodSite.java:52)
        at org.codehaus.groovy.runtime.callsite.AbstractCallSite.callCurrent(AbstractCallSite.java:141)
        at org.codehaus.gant.GantBinding$_initializeGantBinding_closure5_closure16_closure18.doCall(GantBinding.groovy)
        at sun.reflect.NativeMethodAccessorImpl.invoke0(Native Method)
        at sun.reflect.NativeMethodAccessorImpl.invoke(NativeMethodAccessorImpl.java:39)
        at sun.reflect.DelegatingMethodAccessorImpl.invoke(DelegatingMethodAccessorImpl.java:25)
        at java.lang.reflect.Method.invoke(Method.java:597)
        at org.codehaus.groovy.runtime.callsite.PogoMetaMethodSite$PogoCachedMethodSiteNoUnwrapNoCoerce.invoke(PogoMetaMethodSite.java:272)
        at org.codehaus.groovy.runtime.callsite.PogoMetaMethodSite.call(PogoMetaMethodSite.java:64)
        at org.codehaus.groovy.runtime.callsite.AbstractCallSite.call(AbstractCallSite.java:112)
        at org.codehaus.gant.GantBinding.withTargetEvent(GantBinding.groovy:90)
        at org.codehaus.gant.GantBinding.this$4$withTargetEvent(GantBinding.groovy)
        at sun.reflect.NativeMethodAccessorImpl.invoke0(Native Method)
        at sun.reflect.NativeMethodAccessorImpl.invoke(NativeMethodAccessorImpl.java:39)
        at sun.reflect.DelegatingMethodAccessorImpl.invoke(DelegatingMethodAccessorImpl.java:25)
        at java.lang.reflect.Method.invoke(Method.java:597)
        at org.codehaus.groovy.reflection.CachedMethod.invoke(CachedMethod.java:90)
        at groovy.lang.MetaMethod.doMethodInvoke(MetaMethod.java:233)
        at groovy.lang.MetaClassImpl.invokeMethod(MetaClassImpl.java:1085)
        at groovy.lang.ExpandoMetaClass.invokeMethod(ExpandoMetaClass.java:1110)
        at groovy.lang.MetaClassImpl.invokeMethod(MetaClassImpl.java:909)
        at groovy.lang.MetaClassImpl.invokeMethod(MetaClassImpl.java:1030)
        at groovy.lang.ExpandoMetaClass.invokeMethod(ExpandoMetaClass.java:1110)
        at groovy.lang.MetaClassImpl.invokeMethod(MetaClassImpl.java:909)
        at groovy.lang.MetaClassImpl.invokeMethod(MetaClassImpl.java:730)
        at groovy.lang.GroovyObjectSupport.invokeMethod(GroovyObjectSupport.java:44)
        at groovy.lang.MetaClassImpl.invokeMethodOnGroovyObject(MetaClassImpl.java:1150)
        at groovy.lang.MetaClassImpl.invokeMethod(MetaClassImpl.java:1044)
        at groovy.lang.ExpandoMetaClass.invokeMethod(ExpandoMetaClass.java:1110)
        at groovy.lang.MetaClassImpl.invokeMethod(MetaClassImpl.java:909)
        at org.codehaus.groovy.runtime.callsite.PogoMetaClassSite.callCurrent(PogoMetaClassSite.java:66)
        at org.codehaus.groovy.runtime.callsite.AbstractCallSite.callCurrent(AbstractCallSite.java:149)
        at org.codehaus.gant.GantBinding$_initializeGantBinding_closure5_closure16.doCall(GantBinding.groovy:185)
        at sun.reflect.NativeMethodAccessorImpl.invoke0(Native Method)
        at sun.reflect.NativeMethodAccessorImpl.invoke(NativeMethodAccessorImpl.java:39)
        at sun.reflect.DelegatingMethodAccessorImpl.invoke(DelegatingMethodAccessorImpl.java:25)
        at java.lang.reflect.Method.invoke(Method.java:597)
        at org.codehaus.groovy.runtime.callsite.PogoMetaMethodSite$PogoCachedMethodSite.invoke(PogoMetaMethodSite.java:231)
        at org.codehaus.groovy.runtime.callsite.PogoMetaMethodSite.callCurrent(PogoMetaMethodSite.java:52)
        at org.codehaus.groovy.runtime.callsite.AbstractCallSite.callCurrent(AbstractCallSite.java:141)
        at org.codehaus.gant.GantBinding$_initializeGantBinding_closure5_closure16.doCall(GantBinding.groovy)
        at sun.reflect.NativeMethodAccessorImpl.invoke0(Native Method)
        at sun.reflect.NativeMethodAccessorImpl.invoke(NativeMethodAccessorImpl.java:39)
        at sun.reflect.DelegatingMethodAccessorImpl.invoke(DelegatingMethodAccessorImpl.java:25)
        at java.lang.reflect.Method.invoke(Method.java:597)
        at org.codehaus.groovy.reflection.CachedMethod.invoke(CachedMethod.java:90)
        at groovy.lang.MetaMethod.doMethodInvoke(MetaMethod.java:233)
        at groovy.lang.MetaClassImpl.invokeMethod(MetaClassImpl.java:1085)
        at groovy.lang.ExpandoMetaClass.invokeMethod(ExpandoMetaClass.java:1110)
        at groovy.lang.MetaClassImpl.invokeMethod(MetaClassImpl.java:909)
        at groovy.lang.MetaClassImpl.invokePropertyOrMissing(MetaClassImpl.java:1131)
        at groovy.lang.MetaClassImpl.invokeMethod(MetaClassImpl.java:1087)
        at groovy.lang.ExpandoMetaClass.invokeMethod(ExpandoMetaClass.java:1110)
        at groovy.lang.MetaClassImpl.invokeMethod(MetaClassImpl.java:909)
        at groovy.lang.MetaClassImpl.invokeMethod(MetaClassImpl.java:730)
        at groovy.lang.GroovyObjectSupport.invokeMethod(GroovyObjectSupport.java:44)
        at groovy.lang.Script.invokeMethod(Script.java:78)
        at groovy.lang.MetaClassImpl.invokeMethodOnGroovyObject(MetaClassImpl.java:1150)
        at groovy.lang.MetaClassImpl.invokeMethod(MetaClassImpl.java:1044)
        at groovy.lang.ExpandoMetaClass.invokeMethod(ExpandoMetaClass.java:1110)
        at groovy.lang.MetaClassImpl.invokeMethod(MetaClassImpl.java:909)
        at groovy.lang.DelegatingMetaClass.invokeMethod(DelegatingMetaClass.java:149)
        at org.codehaus.gant.GantMetaClass.invokeMethod(GantMetaClass.java:133)
        at org.codehaus.groovy.runtime.callsite.PogoMetaClassSite.callCurrent(PogoMetaClassSite.java:66)
        at org.codehaus.groovy.runtime.callsite.CallSiteArray.defaultCallCurrent(CallSiteArray.java:49)
        at org.codehaus.groovy.runtime.callsite.AbstractCallSite.callCurrent(AbstractCallSite.java:133)
        at org.codehaus.groovy.runtime.callsite.AbstractCallSite.callCurrent(AbstractCallSite.java:137)
        at TestApp$_run_closure1.doCall(TestApp.groovy:32)
        at sun.reflect.NativeMethodAccessorImpl.invoke0(Native Method)
        at sun.reflect.NativeMethodAccessorImpl.invoke(NativeMethodAccessorImpl.java:39)
        at sun.reflect.DelegatingMethodAccessorImpl.invoke(DelegatingMethodAccessorImpl.java:25)
        at java.lang.reflect.Method.invoke(Method.java:597)
        at org.codehaus.groovy.reflection.CachedMethod.invoke(CachedMethod.java:90)
        at groovy.lang.MetaMethod.doMethodInvoke(MetaMethod.java:233)
        at groovy.lang.MetaClassImpl.invokeMethod(MetaClassImpl.java:1085)
        at groovy.lang.ExpandoMetaClass.invokeMethod(ExpandoMetaClass.java:1110)
        at groovy.lang.MetaClassImpl.invokeMethod(MetaClassImpl.java:909)
        at groovy.lang.DelegatingMetaClass.invokeMethod(DelegatingMetaClass.java:149)
        at org.codehaus.gant.GantMetaClass.invokeMethod(GantMetaClass.java:133)
        at org.codehaus.groovy.runtime.callsite.PogoMetaClassSite.call(PogoMetaClassSite.java:39)
        at org.codehaus.groovy.runtime.callsite.CallSiteArray.defaultCall(CallSiteArray.java:45)
        at org.codehaus.groovy.runtime.callsite.PogoMetaClassSite.call(PogoMetaClassSite.java:54)
        at org.codehaus.groovy.runtime.callsite.AbstractCallSite.call(AbstractCallSite.java:116)
        at org.codehaus.gant.GantBinding$_initializeGantBinding_closure5_closure16_closure18.doCall(GantBinding.groovy:185)
        at sun.reflect.NativeMethodAccessorImpl.invoke0(Native Method)
        at sun.reflect.NativeMethodAccessorImpl.invoke(NativeMethodAccessorImpl.java:39)
        at sun.reflect.DelegatingMethodAccessorImpl.invoke(DelegatingMethodAccessorImpl.java:25)
        at java.lang.reflect.Method.invoke(Method.java:597)
        at org.codehaus.groovy.runtime.callsite.PogoMetaMethodSite$PogoCachedMethodSite.invoke(PogoMetaMethodSite.java:231)
        at org.codehaus.groovy.runtime.callsite.PogoMetaMethodSite.callCurrent(PogoMetaMethodSite.java:52)
        at org.codehaus.groovy.runtime.callsite.AbstractCallSite.callCurrent(AbstractCallSite.java:141)
        at org.codehaus.gant.GantBinding$_initializeGantBinding_closure5_closure16_closure18.doCall(GantBinding.groovy)
        at sun.reflect.NativeMethodAccessorImpl.invoke0(Native Method)
        at sun.reflect.NativeMethodAccessorImpl.invoke(NativeMethodAccessorImpl.java:39)
        at sun.reflect.DelegatingMethodAccessorImpl.invoke(DelegatingMethodAccessorImpl.java:25)
        at java.lang.reflect.Method.invoke(Method.java:597)
        at org.codehaus.groovy.runtime.callsite.PogoMetaMethodSite$PogoCachedMethodSiteNoUnwrapNoCoerce.invoke(PogoMetaMethodSite.java:272)
        at org.codehaus.groovy.runtime.callsite.PogoMetaMethodSite.call(PogoMetaMethodSite.java:64)
        at org.codehaus.groovy.runtime.callsite.AbstractCallSite.call(AbstractCallSite.java:112)
        at org.codehaus.gant.GantBinding.withTargetEvent(GantBinding.groovy:90)
        at org.codehaus.gant.GantBinding.this$4$withTargetEvent(GantBinding.groovy)
        at sun.reflect.NativeMethodAccessorImpl.invoke0(Native Method)
        at sun.reflect.NativeMethodAccessorImpl.invoke(NativeMethodAccessorImpl.java:39)
        at sun.reflect.DelegatingMethodAccessorImpl.invoke(DelegatingMethodAccessorImpl.java:25)
        at java.lang.reflect.Method.invoke(Method.java:597)
        at org.codehaus.groovy.reflection.CachedMethod.invoke(CachedMethod.java:90)
        at groovy.lang.MetaMethod.doMethodInvoke(MetaMethod.java:233)
        at groovy.lang.MetaClassImpl.invokeMethod(MetaClassImpl.java:1085)
        at groovy.lang.ExpandoMetaClass.invokeMethod(ExpandoMetaClass.java:1110)
        at groovy.lang.MetaClassImpl.invokeMethod(MetaClassImpl.java:909)
        at groovy.lang.MetaClassImpl.invokeMethod(MetaClassImpl.java:1030)
        at groovy.lang.ExpandoMetaClass.invokeMethod(ExpandoMetaClass.java:1110)
        at groovy.lang.MetaClassImpl.invokeMethod(MetaClassImpl.java:909)
        at groovy.lang.MetaClassImpl.invokeMethod(MetaClassImpl.java:730)
        at groovy.lang.GroovyObjectSupport.invokeMethod(GroovyObjectSupport.java:44)
        at groovy.lang.MetaClassImpl.invokeMethodOnGroovyObject(MetaClassImpl.java:1150)
        at groovy.lang.MetaClassImpl.invokeMethod(MetaClassImpl.java:1044)
        at groovy.lang.ExpandoMetaClass.invokeMethod(ExpandoMetaClass.java:1110)
        at groovy.lang.MetaClassImpl.invokeMethod(MetaClassImpl.java:909)
        at org.codehaus.groovy.runtime.callsite.PogoMetaClassSite.callCurrent(PogoMetaClassSite.java:66)
        at org.codehaus.groovy.runtime.callsite.AbstractCallSite.callCurrent(AbstractCallSite.java:149)
        at org.codehaus.gant.GantBinding$_initializeGantBinding_closure5_closure16.doCall(GantBinding.groovy:185)
        at sun.reflect.NativeMethodAccessorImpl.invoke0(Native Method)
        at sun.reflect.NativeMethodAccessorImpl.invoke(NativeMethodAccessorImpl.java:39)
        at sun.reflect.DelegatingMethodAccessorImpl.invoke(DelegatingMethodAccessorImpl.java:25)
        at java.lang.reflect.Method.invoke(Method.java:597)
        at org.codehaus.groovy.runtime.callsite.PogoMetaMethodSite$PogoCachedMethodSite.invoke(PogoMetaMethodSite.java:231)
        at org.codehaus.groovy.runtime.callsite.PogoMetaMethodSite.callCurrent(PogoMetaMethodSite.java:52)
        at org.codehaus.groovy.runtime.callsite.AbstractCallSite.callCurrent(AbstractCallSite.java:141)
        at org.codehaus.gant.GantBinding$_initializeGantBinding_closure5_closure16.doCall(GantBinding.groovy)
        at sun.reflect.NativeMethodAccessorImpl.invoke0(Native Method)
        at sun.reflect.NativeMethodAccessorImpl.invoke(NativeMethodAccessorImpl.java:39)
        at sun.reflect.DelegatingMethodAccessorImpl.invoke(DelegatingMethodAccessorImpl.java:25)
        at java.lang.reflect.Method.invoke(Method.java:597)
        at org.codehaus.groovy.runtime.callsite.PogoMetaMethodSite$PogoCachedMethodSiteNoUnwrapNoCoerce.invoke(PogoMetaMethodSite.java:272)
        at org.codehaus.groovy.runtime.callsite.PogoMetaMethodSite.call(PogoMetaMethodSite.java:64)
        at org.codehaus.groovy.runtime.callsite.CallSiteArray.defaultCall(CallSiteArray.java:45)
        at org.codehaus.groovy.runtime.callsite.AbstractCallSite.call(AbstractCallSite.java:108)
        at org.codehaus.groovy.runtime.callsite.AbstractCallSite.call(AbstractCallSite.java:112)
        at gant.Gant$_dispatch_closure5.doCall(Gant.groovy:381)
        at sun.reflect.NativeMethodAccessorImpl.invoke0(Native Method)
        at sun.reflect.NativeMethodAccessorImpl.invoke(NativeMethodAccessorImpl.java:39)
        at sun.reflect.DelegatingMethodAccessorImpl.invoke(DelegatingMethodAccessorImpl.java:25)
        at java.lang.reflect.Method.invoke(Method.java:597)
        at org.codehaus.groovy.runtime.callsite.PogoMetaMethodSite$PogoCachedMethodSiteNoUnwrapNoCoerce.invoke(PogoMetaMethodSite.java:272)
        at org.codehaus.groovy.runtime.callsite.PogoMetaMethodSite.call(PogoMetaMethodSite.java:64)
        at org.codehaus.groovy.runtime.callsite.CallSiteArray.defaultCall(CallSiteArray.java:45)
        at org.codehaus.groovy.runtime.callsite.AbstractCallSite.call(AbstractCallSite.java:108)
        at org.codehaus.groovy.runtime.callsite.AbstractCallSite.call(AbstractCallSite.java:116)
        at gant.Gant$_dispatch_closure7.doCall(Gant.groovy:415)
        at sun.reflect.NativeMethodAccessorImpl.invoke0(Native Method)
        at sun.reflect.NativeMethodAccessorImpl.invoke(NativeMethodAccessorImpl.java:39)
        at sun.reflect.DelegatingMethodAccessorImpl.invoke(DelegatingMethodAccessorImpl.java:25)
        at java.lang.reflect.Method.invoke(Method.java:597)
        at org.codehaus.groovy.runtime.callsite.PogoMetaMethodSite$PogoCachedMethodSite.invoke(PogoMetaMethodSite.java:231)
        at org.codehaus.groovy.runtime.callsite.PogoMetaMethodSite.callCurrent(PogoMetaMethodSite.java:52)
        at org.codehaus.groovy.runtime.callsite.CallSiteArray.defaultCallCurrent(CallSiteArray.java:49)
        at org.codehaus.groovy.runtime.callsite.AbstractCallSite.callCurrent(AbstractCallSite.java:133)
        at org.codehaus.groovy.runtime.callsite.AbstractCallSite.callCurrent(AbstractCallSite.java:141)
        at gant.Gant$_dispatch_closure7.doCall(Gant.groovy)
        at sun.reflect.NativeMethodAccessorImpl.invoke0(Native Method)
        at sun.reflect.NativeMethodAccessorImpl.invoke(NativeMethodAccessorImpl.java:39)
        at sun.reflect.DelegatingMethodAccessorImpl.invoke(DelegatingMethodAccessorImpl.java:25)
        at java.lang.reflect.Method.invoke(Method.java:597)
        at org.codehaus.groovy.runtime.callsite.PogoMetaMethodSite$PogoCachedMethodSiteNoUnwrapNoCoerce.invoke(PogoMetaMethodSite.java:272)
        at org.codehaus.groovy.runtime.callsite.PogoMetaMethodSite.call(PogoMetaMethodSite.java:64)
        at org.codehaus.groovy.runtime.callsite.CallSiteArray.defaultCall(CallSiteArray.java:45)
        at org.codehaus.groovy.runtime.callsite.AbstractCallSite.call(AbstractCallSite.java:108)
        at org.codehaus.groovy.runtime.callsite.AbstractCallSite.call(AbstractCallSite.java:112)
        at gant.Gant.withBuildListeners(Gant.groovy:427)
        at gant.Gant.this$2$withBuildListeners(Gant.groovy)
        at gant.Gant$this$2$withBuildListeners.callCurrent(Unknown Source)
        at org.codehaus.groovy.runtime.callsite.CallSiteArray.defaultCallCurrent(CallSiteArray.java:49)
        at org.codehaus.groovy.runtime.callsite.AbstractCallSite.callCurrent(AbstractCallSite.java:133)
        at org.codehaus.groovy.runtime.callsite.AbstractCallSite.callCurrent(AbstractCallSite.java:141)
        at gant.Gant.dispatch(Gant.groovy:415)
        at gant.Gant.this$2$dispatch(Gant.groovy)
        at sun.reflect.NativeMethodAccessorImpl.invoke0(Native Method)
        at sun.reflect.NativeMethodAccessorImpl.invoke(NativeMethodAccessorImpl.java:39)
        at sun.reflect.DelegatingMethodAccessorImpl.invoke(DelegatingMethodAccessorImpl.java:25)
        at java.lang.reflect.Method.invoke(Method.java:597)
        at org.codehaus.groovy.reflection.CachedMethod.invoke(CachedMethod.java:90)
        at groovy.lang.MetaMethod.doMethodInvoke(MetaMethod.java:233)
        at groovy.lang.MetaClassImpl.invokeMethod(MetaClassImpl.java:1085)
        at groovy.lang.ExpandoMetaClass.invokeMethod(ExpandoMetaClass.java:1110)
        at groovy.lang.MetaClassImpl.invokeMethod(MetaClassImpl.java:909)
        at groovy.lang.MetaClassImpl.invokeMethod(MetaClassImpl.java:732)
        at gant.Gant.invokeMethod(Gant.groovy)
        at groovy.lang.GroovyObject$invokeMethod.callCurrent(Unknown Source)
        at org.codehaus.groovy.runtime.callsite.CallSiteArray.defaultCallCurrent(CallSiteArray.java:49)
        at org.codehaus.groovy.runtime.callsite.AbstractCallSite.callCurrent(AbstractCallSite.java:133)
        at org.codehaus.groovy.runtime.callsite.AbstractCallSite.callCurrent(AbstractCallSite.java:145)
        at gant.Gant.executeTargets(Gant.groovy:591)
        at sun.reflect.NativeMethodAccessorImpl.invoke0(Native Method)
        at sun.reflect.NativeMethodAccessorImpl.invoke(NativeMethodAccessorImpl.java:39)
        at sun.reflect.DelegatingMethodAccessorImpl.invoke(DelegatingMethodAccessorImpl.java:25)
        at java.lang.reflect.Method.invoke(Method.java:597)
        at org.codehaus.groovy.runtime.callsite.PogoMetaMethodSite$PogoCachedMethodSite.invoke(PogoMetaMethodSite.java:231)
        at org.codehaus.groovy.runtime.callsite.PogoMetaMethodSite.callCurrent(PogoMetaMethodSite.java:52)
        at org.codehaus.groovy.runtime.callsite.CallSiteArray.defaultCallCurrent(CallSiteArray.java:49)
        at org.codehaus.groovy.runtime.callsite.AbstractCallSite.callCurrent(AbstractCallSite.java:133)
        at org.codehaus.groovy.runtime.callsite.AbstractCallSite.callCurrent(AbstractCallSite.java:145)
        at gant.Gant.executeTargets(Gant.groovy:590)
        at org.codehaus.groovy.grails.cli.GrailsScriptRunner.executeWithGantInstance(GrailsScriptRunner.java:773)
        at org.codehaus.groovy.grails.cli.GrailsScriptRunner.executeScriptFile(GrailsScriptRunner.java:571)
        at org.codehaus.groovy.grails.cli.GrailsScriptRunner.executeScriptWithCaching(GrailsScriptRunner.java:470)
        at org.codehaus.groovy.grails.cli.GrailsScriptRunner.callPluginOrGrailsScript(GrailsScriptRunner.java:414)
        at org.codehaus.groovy.grails.cli.GrailsScriptRunner.executeCommand(GrailsScriptRunner.java:378)
        at org.codehaus.groovy.grails.cli.GrailsScriptRunner.main(GrailsScriptRunner.java:226)
        at sun.reflect.NativeMethodAccessorImpl.invoke0(Native Method)
        at sun.reflect.NativeMethodAccessorImpl.invoke(NativeMethodAccessorImpl.java:39)
        at sun.reflect.DelegatingMethodAccessorImpl.invoke(DelegatingMethodAccessorImpl.java:25)
        at java.lang.reflect.Method.invoke(Method.java:597)
        at org.codehaus.groovy.grails.cli.support.GrailsStarter.rootLoader(GrailsStarter.java:235)
        at org.codehaus.groovy.grails.cli.support.GrailsStarter.main(GrailsStarter.java:263)
        at sun.reflect.NativeMethodAccessorImpl.invoke0(Native Method)
        at sun.reflect.NativeMethodAccessorImpl.invoke(NativeMethodAccessorImpl.java:39)
        at sun.reflect.DelegatingMethodAccessorImpl.invoke(DelegatingMethodAccessorImpl.java:25)
        at java.lang.reflect.Method.invoke(Method.java:597)
        at com.intellij.rt.execution.application.AppMain.main(AppMain.java:120)
Caused by: java.lang.ClassNotFoundException: org.junit.internal.AssumptionViolatedException
        at java.net.URLClassLoader$1.run(URLClassLoader.java:202)
        at java.security.AccessController.doPrivileged(Native Method)
        at java.net.URLClassLoader.findClass(URLClassLoader.java:190)
        at java.lang.ClassLoader.loadClass(ClassLoader.java:306)
        at sun.misc.Launcher$AppClassLoader.loadClass(Launcher.java:301)
        at java.lang.ClassLoader.loadClass(ClassLoader.java:247)
        at org.codehaus.groovy.grails.cli.support.GrailsRootLoader.loadClass(GrailsRootLoader.java:54)
        at java.lang.ClassLoader.loadClass(ClassLoader.java:247)
        ... 297 more
| Error Fatal error running tests: org/junit/internal/AssumptionViolatedException
[junitreport] Processing /Users/amit/git/myapp/target/test-reports/TESTS-TestSuites.xml to /var/folders/37/3k5xbcpd371d9pxnw31x4qym0000gn/T/null460073464
[junitreport] Loading stylesheet /Users/amit/workspace/grails-2.3.0/src/resources/tests/junit-frames.xsl
[junitreport] Transform time: 443ms
[junitreport] Deleting: /var/folders/37/3k5xbcpd371d9pxnw31x4qym0000gn/T/null460073464
| Tests FAILED  - view reports in /Users/amit/git/myapp/target/test-reports
| Error Error executing script TestApp: org/junit/internal/AssumptionViolatedException
java.lang.NoClassDefFoundError: org/junit/internal/AssumptionViolatedException
        at org.codehaus.groovy.grails.test.spock.GrailsSpecTestType.createSuite(GrailsSpecTestType.groovy:80)
        at sun.reflect.NativeMethodAccessorImpl.invoke0(Native Method)
        at sun.reflect.NativeMethodAccessorImpl.invoke(NativeMethodAccessorImpl.java:39)
        at sun.reflect.DelegatingMethodAccessorImpl.invoke(DelegatingMethodAccessorImpl.java:25)
        at java.lang.reflect.Method.invoke(Method.java:597)
        at org.codehaus.groovy.runtime.callsite.PogoMetaMethodSite$PogoCachedMethodSiteNoUnwrapNoCoerce.invoke(PogoMetaMethodSite.java:272)
        at org.codehaus.groovy.runtime.callsite.PogoMetaMethodSite.callCurrent(PogoMetaMethodSite.java:52)
        at org.codehaus.groovy.runtime.callsite.CallSiteArray.defaultCallCurrent(CallSiteArray.java:49)
        at org.codehaus.groovy.runtime.callsite.AbstractCallSite.callCurrent(AbstractCallSite.java:133)
        at org.codehaus.groovy.runtime.callsite.AbstractCallSite.callCurrent(AbstractCallSite.java:141)
        at org.codehaus.groovy.grails.test.spock.GrailsSpecTestType.doPrepare(GrailsSpecTestType.groovy:65)
        at org.codehaus.groovy.grails.test.support.GrailsTestTypeSupport.prepare(GrailsTestTypeSupport.groovy:98)
        at org.codehaus.groovy.grails.test.runner.GrailsProjectTestRunner.runTests(GrailsProjectTestRunner.groovy:389)
        at org.codehaus.groovy.grails.test.runner.GrailsProjectTestRunner.processTests(GrailsProjectTestRunner.groovy:381)
        at sun.reflect.NativeMethodAccessorImpl.invoke0(Native Method)
        at sun.reflect.NativeMethodAccessorImpl.invoke(NativeMethodAccessorImpl.java:39)
        at sun.reflect.DelegatingMethodAccessorImpl.invoke(DelegatingMethodAccessorImpl.java:25)
        at java.lang.reflect.Method.invoke(Method.java:597)
        at org.codehaus.groovy.reflection.CachedMethod.invoke(CachedMethod.java:90)
        at groovy.lang.MetaMethod.doMethodInvoke(MetaMethod.java:233)
        at groovy.lang.MetaClassImpl.invokeMethod(MetaClassImpl.java:1085)
        at groovy.lang.ExpandoMetaClass.invokeMethod(ExpandoMetaClass.java:1110)
        at groovy.lang.MetaClassImpl.invokeMethod(MetaClassImpl.java:909)
        at groovy.lang.MetaClassImpl.invokeMethod(MetaClassImpl.java:1030)
        at groovy.lang.ExpandoMetaClass.invokeMethod(ExpandoMetaClass.java:1110)
        at groovy.lang.MetaClassImpl.invokeMethod(MetaClassImpl.java:909)
        at org.codehaus.groovy.runtime.callsite.PogoMetaClassSite.callCurrent(PogoMetaClassSite.java:66)
        at org.codehaus.groovy.runtime.callsite.CallSiteArray.defaultCallCurrent(CallSiteArray.java:49)
        at org.codehaus.groovy.runtime.callsite.AbstractCallSite.callCurrent(AbstractCallSite.java:133)
        at org.codehaus.groovy.runtime.callsite.AbstractCallSite.callCurrent(AbstractCallSite.java:141)
        at org.codehaus.groovy.grails.test.runner.GrailsProjectTestRunner$_runAllTests_closure7.doCall(GrailsProjectTestRunner.groovy:300)
        at sun.reflect.NativeMethodAccessorImpl.invoke0(Native Method)
        at sun.reflect.NativeMethodAccessorImpl.invoke(NativeMethodAccessorImpl.java:39)
        at sun.reflect.DelegatingMethodAccessorImpl.invoke(DelegatingMethodAccessorImpl.java:25)
        at java.lang.reflect.Method.invoke(Method.java:597)
        at org.codehaus.groovy.reflection.CachedMethod.invoke(CachedMethod.java:90)
        at groovy.lang.MetaMethod.doMethodInvoke(MetaMethod.java:233)
        at groovy.lang.MetaClassImpl.invokeMethod(MetaClassImpl.java:1085)
        at groovy.lang.ExpandoMetaClass.invokeMethod(ExpandoMetaClass.java:1110)
        at groovy.lang.MetaClassImpl.invokeMethod(MetaClassImpl.java:909)
        at groovy.lang.Closure.call(Closure.java:411)
        at org.codehaus.groovy.runtime.DefaultGroovyMethods.callClosureForMapEntry(DefaultGroovyMethods.java:3873)
        at org.codehaus.groovy.runtime.DefaultGroovyMethods.each(DefaultGroovyMethods.java:1354)
        at org.codehaus.groovy.runtime.dgm$149.invoke(Unknown Source)
        at org.codehaus.groovy.runtime.callsite.PojoMetaMethodSite$PojoMetaMethodSiteNoUnwrapNoCoerce.invoke(PojoMetaMethodSite.java:271)
        at org.codehaus.groovy.runtime.callsite.PojoMetaMethodSite.call(PojoMetaMethodSite.java:53)
        at org.codehaus.groovy.runtime.callsite.CallSiteArray.defaultCall(CallSiteArray.java:45)
        at org.codehaus.groovy.runtime.callsite.AbstractCallSite.call(AbstractCallSite.java:108)
        at org.codehaus.groovy.runtime.callsite.AbstractCallSite.call(AbstractCallSite.java:116)
        at org.codehaus.groovy.grails.test.runner.GrailsProjectTestRunner.runAllTests(GrailsProjectTestRunner.groovy:286)
        at org.codehaus.groovy.grails.test.runner.GrailsProjectTestRunner.runAllTests(GrailsProjectTestRunner.groovy:204)
        at org.codehaus.groovy.grails.test.runner.GrailsProjectTestRunner$runAllTests.call(Unknown Source)
        at org.codehaus.groovy.runtime.callsite.CallSiteArray.defaultCall(CallSiteArray.java:45)
        at org.codehaus.groovy.runtime.callsite.AbstractCallSite.call(AbstractCallSite.java:108)
        at org.codehaus.groovy.runtime.callsite.AbstractCallSite.call(AbstractCallSite.java:120)
        at _GrailsTest_groovy$_run_closure1.doCall(_GrailsTest_groovy:95)
        at sun.reflect.NativeMethodAccessorImpl.invoke0(Native Method)
        at sun.reflect.NativeMethodAccessorImpl.invoke(NativeMethodAccessorImpl.java:39)
        at sun.reflect.DelegatingMethodAccessorImpl.invoke(DelegatingMethodAccessorImpl.java:25)
        at java.lang.reflect.Method.invoke(Method.java:597)
        at org.codehaus.groovy.reflection.CachedMethod.invoke(CachedMethod.java:90)
        at groovy.lang.MetaMethod.doMethodInvoke(MetaMethod.java:233)
        at groovy.lang.MetaClassImpl.invokeMethod(MetaClassImpl.java:1085)
        at groovy.lang.ExpandoMetaClass.invokeMethod(ExpandoMetaClass.java:1110)
        at groovy.lang.MetaClassImpl.invokeMethod(MetaClassImpl.java:909)
        at groovy.lang.DelegatingMetaClass.invokeMethod(DelegatingMetaClass.java:149)
        at org.codehaus.gant.GantMetaClass.invokeMethod(GantMetaClass.java:133)
        at org.codehaus.groovy.runtime.callsite.PogoMetaClassSite.call(PogoMetaClassSite.java:39)
        at org.codehaus.groovy.runtime.callsite.CallSiteArray.defaultCall(CallSiteArray.java:45)
        at org.codehaus.groovy.runtime.callsite.PogoMetaClassSite.call(PogoMetaClassSite.java:54)
        at org.codehaus.groovy.runtime.callsite.AbstractCallSite.call(AbstractCallSite.java:116)
        at org.codehaus.gant.GantBinding$_initializeGantBinding_closure5_closure16_closure18.doCall(GantBinding.groovy:185)
        at sun.reflect.NativeMethodAccessorImpl.invoke0(Native Method)
        at sun.reflect.NativeMethodAccessorImpl.invoke(NativeMethodAccessorImpl.java:39)
        at sun.reflect.DelegatingMethodAccessorImpl.invoke(DelegatingMethodAccessorImpl.java:25)
        at java.lang.reflect.Method.invoke(Method.java:597)
        at org.codehaus.groovy.runtime.callsite.PogoMetaMethodSite$PogoCachedMethodSite.invoke(PogoMetaMethodSite.java:231)
        at org.codehaus.groovy.runtime.callsite.PogoMetaMethodSite.callCurrent(PogoMetaMethodSite.java:52)
        at org.codehaus.groovy.runtime.callsite.AbstractCallSite.callCurrent(AbstractCallSite.java:141)
        at org.codehaus.gant.GantBinding$_initializeGantBinding_closure5_closure16_closure18.doCall(GantBinding.groovy)
        at sun.reflect.NativeMethodAccessorImpl.invoke0(Native Method)
        at sun.reflect.NativeMethodAccessorImpl.invoke(NativeMethodAccessorImpl.java:39)
        at sun.reflect.DelegatingMethodAccessorImpl.invoke(DelegatingMethodAccessorImpl.java:25)
        at java.lang.reflect.Method.invoke(Method.java:597)
        at org.codehaus.groovy.runtime.callsite.PogoMetaMethodSite$PogoCachedMethodSiteNoUnwrapNoCoerce.invoke(PogoMetaMethodSite.java:272)
        at org.codehaus.groovy.runtime.callsite.PogoMetaMethodSite.call(PogoMetaMethodSite.java:64)
        at org.codehaus.groovy.runtime.callsite.AbstractCallSite.call(AbstractCallSite.java:112)
        at org.codehaus.gant.GantBinding.withTargetEvent(GantBinding.groovy:90)
        at org.codehaus.gant.GantBinding.this$4$withTargetEvent(GantBinding.groovy)
        at sun.reflect.NativeMethodAccessorImpl.invoke0(Native Method)
        at sun.reflect.NativeMethodAccessorImpl.invoke(NativeMethodAccessorImpl.java:39)
        at sun.reflect.DelegatingMethodAccessorImpl.invoke(DelegatingMethodAccessorImpl.java:25)
        at java.lang.reflect.Method.invoke(Method.java:597)
        at org.codehaus.groovy.reflection.CachedMethod.invoke(CachedMethod.java:90)
        at groovy.lang.MetaMethod.doMethodInvoke(MetaMethod.java:233)
        at groovy.lang.MetaClassImpl.invokeMethod(MetaClassImpl.java:1085)
        at groovy.lang.ExpandoMetaClass.invokeMethod(ExpandoMetaClass.java:1110)
        at groovy.lang.MetaClassImpl.invokeMethod(MetaClassImpl.java:909)
        at groovy.lang.MetaClassImpl.invokeMethod(MetaClassImpl.java:1030)
        at groovy.lang.ExpandoMetaClass.invokeMethod(ExpandoMetaClass.java:1110)
        at groovy.lang.MetaClassImpl.invokeMethod(MetaClassImpl.java:909)
        at groovy.lang.MetaClassImpl.invokeMethod(MetaClassImpl.java:730)
        at groovy.lang.GroovyObjectSupport.invokeMethod(GroovyObjectSupport.java:44)
        at groovy.lang.MetaClassImpl.invokeMethodOnGroovyObject(MetaClassImpl.java:1150)
        at groovy.lang.MetaClassImpl.invokeMethod(MetaClassImpl.java:1044)
        at groovy.lang.ExpandoMetaClass.invokeMethod(ExpandoMetaClass.java:1110)
        at groovy.lang.MetaClassImpl.invokeMethod(MetaClassImpl.java:909)
        at org.codehaus.groovy.runtime.callsite.PogoMetaClassSite.callCurrent(PogoMetaClassSite.java:66)
        at org.codehaus.groovy.runtime.callsite.AbstractCallSite.callCurrent(AbstractCallSite.java:149)
        at org.codehaus.gant.GantBinding$_initializeGantBinding_closure5_closure16.doCall(GantBinding.groovy:185)
        at sun.reflect.NativeMethodAccessorImpl.invoke0(Native Method)
        at sun.reflect.NativeMethodAccessorImpl.invoke(NativeMethodAccessorImpl.java:39)
        at sun.reflect.DelegatingMethodAccessorImpl.invoke(DelegatingMethodAccessorImpl.java:25)
        at java.lang.reflect.Method.invoke(Method.java:597)
        at org.codehaus.groovy.runtime.callsite.PogoMetaMethodSite$PogoCachedMethodSite.invoke(PogoMetaMethodSite.java:231)
        at org.codehaus.groovy.runtime.callsite.PogoMetaMethodSite.callCurrent(PogoMetaMethodSite.java:52)
        at org.codehaus.groovy.runtime.callsite.AbstractCallSite.callCurrent(AbstractCallSite.java:141)
        at org.codehaus.gant.GantBinding$_initializeGantBinding_closure5_closure16.doCall(GantBinding.groovy)
        at sun.reflect.NativeMethodAccessorImpl.invoke0(Native Method)
        at sun.reflect.NativeMethodAccessorImpl.invoke(NativeMethodAccessorImpl.java:39)
        at sun.reflect.DelegatingMethodAccessorImpl.invoke(DelegatingMethodAccessorImpl.java:25)
        at java.lang.reflect.Method.invoke(Method.java:597)
        at org.codehaus.groovy.reflection.CachedMethod.invoke(CachedMethod.java:90)
        at groovy.lang.MetaMethod.doMethodInvoke(MetaMethod.java:233)
        at groovy.lang.MetaClassImpl.invokeMethod(MetaClassImpl.java:1085)
        at groovy.lang.ExpandoMetaClass.invokeMethod(ExpandoMetaClass.java:1110)
        at groovy.lang.MetaClassImpl.invokeMethod(MetaClassImpl.java:909)
        at groovy.lang.MetaClassImpl.invokePropertyOrMissing(MetaClassImpl.java:1131)
        at groovy.lang.MetaClassImpl.invokeMethod(MetaClassImpl.java:1087)
        at groovy.lang.ExpandoMetaClass.invokeMethod(ExpandoMetaClass.java:1110)
        at groovy.lang.MetaClassImpl.invokeMethod(MetaClassImpl.java:909)
        at groovy.lang.MetaClassImpl.invokeMethod(MetaClassImpl.java:730)
        at groovy.lang.GroovyObjectSupport.invokeMethod(GroovyObjectSupport.java:44)
        at groovy.lang.Script.invokeMethod(Script.java:78)
        at groovy.lang.MetaClassImpl.invokeMethodOnGroovyObject(MetaClassImpl.java:1150)
        at groovy.lang.MetaClassImpl.invokeMethod(MetaClassImpl.java:1044)
        at groovy.lang.ExpandoMetaClass.invokeMethod(ExpandoMetaClass.java:1110)
        at groovy.lang.MetaClassImpl.invokeMethod(MetaClassImpl.java:909)
        at groovy.lang.DelegatingMetaClass.invokeMethod(DelegatingMetaClass.java:149)
        at org.codehaus.gant.GantMetaClass.invokeMethod(GantMetaClass.java:133)
        at org.codehaus.groovy.runtime.callsite.PogoMetaClassSite.callCurrent(PogoMetaClassSite.java:66)
        at org.codehaus.groovy.runtime.callsite.CallSiteArray.defaultCallCurrent(CallSiteArray.java:49)
        at org.codehaus.groovy.runtime.callsite.AbstractCallSite.callCurrent(AbstractCallSite.java:133)
        at org.codehaus.groovy.runtime.callsite.AbstractCallSite.callCurrent(AbstractCallSite.java:137)
        at TestApp$_run_closure1.doCall(TestApp.groovy:32)
        at sun.reflect.NativeMethodAccessorImpl.invoke0(Native Method)
        at sun.reflect.NativeMethodAccessorImpl.invoke(NativeMethodAccessorImpl.java:39)
        at sun.reflect.DelegatingMethodAccessorImpl.invoke(DelegatingMethodAccessorImpl.java:25)
        at java.lang.reflect.Method.invoke(Method.java:597)
        at org.codehaus.groovy.reflection.CachedMethod.invoke(CachedMethod.java:90)
        at groovy.lang.MetaMethod.doMethodInvoke(MetaMethod.java:233)
        at groovy.lang.MetaClassImpl.invokeMethod(MetaClassImpl.java:1085)
        at groovy.lang.ExpandoMetaClass.invokeMethod(ExpandoMetaClass.java:1110)
        at groovy.lang.MetaClassImpl.invokeMethod(MetaClassImpl.java:909)
        at groovy.lang.DelegatingMetaClass.invokeMethod(DelegatingMetaClass.java:149)
        at org.codehaus.gant.GantMetaClass.invokeMethod(GantMetaClass.java:133)
        at org.codehaus.groovy.runtime.callsite.PogoMetaClassSite.call(PogoMetaClassSite.java:39)
        at org.codehaus.groovy.runtime.callsite.CallSiteArray.defaultCall(CallSiteArray.java:45)
        at org.codehaus.groovy.runtime.callsite.PogoMetaClassSite.call(PogoMetaClassSite.java:54)
        at org.codehaus.groovy.runtime.callsite.AbstractCallSite.call(AbstractCallSite.java:116)
        at org.codehaus.gant.GantBinding$_initializeGantBinding_closure5_closure16_closure18.doCall(GantBinding.groovy:185)
        at sun.reflect.NativeMethodAccessorImpl.invoke0(Native Method)
        at sun.reflect.NativeMethodAccessorImpl.invoke(NativeMethodAccessorImpl.java:39)
        at sun.reflect.DelegatingMethodAccessorImpl.invoke(DelegatingMethodAccessorImpl.java:25)
        at java.lang.reflect.Method.invoke(Method.java:597)
        at org.codehaus.groovy.runtime.callsite.PogoMetaMethodSite$PogoCachedMethodSite.invoke(PogoMetaMethodSite.java:231)
        at org.codehaus.groovy.runtime.callsite.PogoMetaMethodSite.callCurrent(PogoMetaMethodSite.java:52)
        at org.codehaus.groovy.runtime.callsite.AbstractCallSite.callCurrent(AbstractCallSite.java:141)
        at org.codehaus.gant.GantBinding$_initializeGantBinding_closure5_closure16_closure18.doCall(GantBinding.groovy)
        at sun.reflect.NativeMethodAccessorImpl.invoke0(Native Method)
        at sun.reflect.NativeMethodAccessorImpl.invoke(NativeMethodAccessorImpl.java:39)
        at sun.reflect.DelegatingMethodAccessorImpl.invoke(DelegatingMethodAccessorImpl.java:25)
        at java.lang.reflect.Method.invoke(Method.java:597)
        at org.codehaus.groovy.runtime.callsite.PogoMetaMethodSite$PogoCachedMethodSiteNoUnwrapNoCoerce.invoke(PogoMetaMethodSite.java:272)
        at org.codehaus.groovy.runtime.callsite.PogoMetaMethodSite.call(PogoMetaMethodSite.java:64)
        at org.codehaus.groovy.runtime.callsite.AbstractCallSite.call(AbstractCallSite.java:112)
        at org.codehaus.gant.GantBinding.withTargetEvent(GantBinding.groovy:90)
        at org.codehaus.gant.GantBinding.this$4$withTargetEvent(GantBinding.groovy)
        at sun.reflect.NativeMethodAccessorImpl.invoke0(Native Method)
        at sun.reflect.NativeMethodAccessorImpl.invoke(NativeMethodAccessorImpl.java:39)
        at sun.reflect.DelegatingMethodAccessorImpl.invoke(DelegatingMethodAccessorImpl.java:25)
        at java.lang.reflect.Method.invoke(Method.java:597)
        at org.codehaus.groovy.reflection.CachedMethod.invoke(CachedMethod.java:90)
        at groovy.lang.MetaMethod.doMethodInvoke(MetaMethod.java:233)
        at groovy.lang.MetaClassImpl.invokeMethod(MetaClassImpl.java:1085)
        at groovy.lang.ExpandoMetaClass.invokeMethod(ExpandoMetaClass.java:1110)
        at groovy.lang.MetaClassImpl.invokeMethod(MetaClassImpl.java:909)
        at groovy.lang.MetaClassImpl.invokeMethod(MetaClassImpl.java:1030)
        at groovy.lang.ExpandoMetaClass.invokeMethod(ExpandoMetaClass.java:1110)
        at groovy.lang.MetaClassImpl.invokeMethod(MetaClassImpl.java:909)
        at groovy.lang.MetaClassImpl.invokeMethod(MetaClassImpl.java:730)
        at groovy.lang.GroovyObjectSupport.invokeMethod(GroovyObjectSupport.java:44)
        at groovy.lang.MetaClassImpl.invokeMethodOnGroovyObject(MetaClassImpl.java:1150)
        at groovy.lang.MetaClassImpl.invokeMethod(MetaClassImpl.java:1044)
        at groovy.lang.ExpandoMetaClass.invokeMethod(ExpandoMetaClass.java:1110)
        at groovy.lang.MetaClassImpl.invokeMethod(MetaClassImpl.java:909)
        at org.codehaus.groovy.runtime.callsite.PogoMetaClassSite.callCurrent(PogoMetaClassSite.java:66)
        at org.codehaus.groovy.runtime.callsite.AbstractCallSite.callCurrent(AbstractCallSite.java:149)
        at org.codehaus.gant.GantBinding$_initializeGantBinding_closure5_closure16.doCall(GantBinding.groovy:185)
        at sun.reflect.NativeMethodAccessorImpl.invoke0(Native Method)
        at sun.reflect.NativeMethodAccessorImpl.invoke(NativeMethodAccessorImpl.java:39)
        at sun.reflect.DelegatingMethodAccessorImpl.invoke(DelegatingMethodAccessorImpl.java:25)
        at java.lang.reflect.Method.invoke(Method.java:597)
        at org.codehaus.groovy.runtime.callsite.PogoMetaMethodSite$PogoCachedMethodSite.invoke(PogoMetaMethodSite.java:231)
        at org.codehaus.groovy.runtime.callsite.PogoMetaMethodSite.callCurrent(PogoMetaMethodSite.java:52)
        at org.codehaus.groovy.runtime.callsite.AbstractCallSite.callCurrent(AbstractCallSite.java:141)
        at org.codehaus.gant.GantBinding$_initializeGantBinding_closure5_closure16.doCall(GantBinding.groovy)
        at sun.reflect.NativeMethodAccessorImpl.invoke0(Native Method)
        at sun.reflect.NativeMethodAccessorImpl.invoke(NativeMethodAccessorImpl.java:39)
        at sun.reflect.DelegatingMethodAccessorImpl.invoke(DelegatingMethodAccessorImpl.java:25)
        at java.lang.reflect.Method.invoke(Method.java:597)
        at org.codehaus.groovy.runtime.callsite.PogoMetaMethodSite$PogoCachedMethodSiteNoUnwrapNoCoerce.invoke(PogoMetaMethodSite.java:272)
        at org.codehaus.groovy.runtime.callsite.PogoMetaMethodSite.call(PogoMetaMethodSite.java:64)
        at org.codehaus.groovy.runtime.callsite.CallSiteArray.defaultCall(CallSiteArray.java:45)
        at org.codehaus.groovy.runtime.callsite.AbstractCallSite.call(AbstractCallSite.java:108)
        at org.codehaus.groovy.runtime.callsite.AbstractCallSite.call(AbstractCallSite.java:112)
        at gant.Gant$_dispatch_closure5.doCall(Gant.groovy:381)
        at sun.reflect.NativeMethodAccessorImpl.invoke0(Native Method)
        at sun.reflect.NativeMethodAccessorImpl.invoke(NativeMethodAccessorImpl.java:39)
        at sun.reflect.DelegatingMethodAccessorImpl.invoke(DelegatingMethodAccessorImpl.java:25)
        at java.lang.reflect.Method.invoke(Method.java:597)
        at org.codehaus.groovy.runtime.callsite.PogoMetaMethodSite$PogoCachedMethodSiteNoUnwrapNoCoerce.invoke(PogoMetaMethodSite.java:272)
        at org.codehaus.groovy.runtime.callsite.PogoMetaMethodSite.call(PogoMetaMethodSite.java:64)
        at org.codehaus.groovy.runtime.callsite.CallSiteArray.defaultCall(CallSiteArray.java:45)
        at org.codehaus.groovy.runtime.callsite.AbstractCallSite.call(AbstractCallSite.java:108)
        at org.codehaus.groovy.runtime.callsite.AbstractCallSite.call(AbstractCallSite.java:116)
        at gant.Gant$_dispatch_closure7.doCall(Gant.groovy:415)
        at sun.reflect.NativeMethodAccessorImpl.invoke0(Native Method)
        at sun.reflect.NativeMethodAccessorImpl.invoke(NativeMethodAccessorImpl.java:39)
        at sun.reflect.DelegatingMethodAccessorImpl.invoke(DelegatingMethodAccessorImpl.java:25)
        at java.lang.reflect.Method.invoke(Method.java:597)
        at org.codehaus.groovy.runtime.callsite.PogoMetaMethodSite$PogoCachedMethodSite.invoke(PogoMetaMethodSite.java:231)
        at org.codehaus.groovy.runtime.callsite.PogoMetaMethodSite.callCurrent(PogoMetaMethodSite.java:52)
        at org.codehaus.groovy.runtime.callsite.CallSiteArray.defaultCallCurrent(CallSiteArray.java:49)
        at org.codehaus.groovy.runtime.callsite.AbstractCallSite.callCurrent(AbstractCallSite.java:133)
        at org.codehaus.groovy.runtime.callsite.AbstractCallSite.callCurrent(AbstractCallSite.java:141)
        at gant.Gant$_dispatch_closure7.doCall(Gant.groovy)
        at sun.reflect.NativeMethodAccessorImpl.invoke0(Native Method)
        at sun.reflect.NativeMethodAccessorImpl.invoke(NativeMethodAccessorImpl.java:39)
        at sun.reflect.DelegatingMethodAccessorImpl.invoke(DelegatingMethodAccessorImpl.java:25)
        at java.lang.reflect.Method.invoke(Method.java:597)
        at org.codehaus.groovy.runtime.callsite.PogoMetaMethodSite$PogoCachedMethodSiteNoUnwrapNoCoerce.invoke(PogoMetaMethodSite.java:272)
        at org.codehaus.groovy.runtime.callsite.PogoMetaMethodSite.call(PogoMetaMethodSite.java:64)
        at org.codehaus.groovy.runtime.callsite.CallSiteArray.defaultCall(CallSiteArray.java:45)
        at org.codehaus.groovy.runtime.callsite.AbstractCallSite.call(AbstractCallSite.java:108)
        at org.codehaus.groovy.runtime.callsite.AbstractCallSite.call(AbstractCallSite.java:112)
        at gant.Gant.withBuildListeners(Gant.groovy:427)
        at gant.Gant.this$2$withBuildListeners(Gant.groovy)
        at gant.Gant$this$2$withBuildListeners.callCurrent(Unknown Source)
        at org.codehaus.groovy.runtime.callsite.CallSiteArray.defaultCallCurrent(CallSiteArray.java:49)
        at org.codehaus.groovy.runtime.callsite.AbstractCallSite.callCurrent(AbstractCallSite.java:133)
        at org.codehaus.groovy.runtime.callsite.AbstractCallSite.callCurrent(AbstractCallSite.java:141)
        at gant.Gant.dispatch(Gant.groovy:415)
        at gant.Gant.this$2$dispatch(Gant.groovy)
        at sun.reflect.NativeMethodAccessorImpl.invoke0(Native Method)
        at sun.reflect.NativeMethodAccessorImpl.invoke(NativeMethodAccessorImpl.java:39)
        at sun.reflect.DelegatingMethodAccessorImpl.invoke(DelegatingMethodAccessorImpl.java:25)
        at java.lang.reflect.Method.invoke(Method.java:597)
        at org.codehaus.groovy.reflection.CachedMethod.invoke(CachedMethod.java:90)
        at groovy.lang.MetaMethod.doMethodInvoke(MetaMethod.java:233)
        at groovy.lang.MetaClassImpl.invokeMethod(MetaClassImpl.java:1085)
        at groovy.lang.ExpandoMetaClass.invokeMethod(ExpandoMetaClass.java:1110)
        at groovy.lang.MetaClassImpl.invokeMethod(MetaClassImpl.java:909)
        at groovy.lang.MetaClassImpl.invokeMethod(MetaClassImpl.java:732)
        at gant.Gant.invokeMethod(Gant.groovy)
        at groovy.lang.GroovyObject$invokeMethod.callCurrent(Unknown Source)
        at org.codehaus.groovy.runtime.callsite.CallSiteArray.defaultCallCurrent(CallSiteArray.java:49)
        at org.codehaus.groovy.runtime.callsite.AbstractCallSite.callCurrent(AbstractCallSite.java:133)
        at org.codehaus.groovy.runtime.callsite.AbstractCallSite.callCurrent(AbstractCallSite.java:145)
        at gant.Gant.executeTargets(Gant.groovy:591)
        at sun.reflect.NativeMethodAccessorImpl.invoke0(Native Method)
        at sun.reflect.NativeMethodAccessorImpl.invoke(NativeMethodAccessorImpl.java:39)
        at sun.reflect.DelegatingMethodAccessorImpl.invoke(DelegatingMethodAccessorImpl.java:25)
        at java.lang.reflect.Method.invoke(Method.java:597)
        at org.codehaus.groovy.runtime.callsite.PogoMetaMethodSite$PogoCachedMethodSite.invoke(PogoMetaMethodSite.java:231)
        at org.codehaus.groovy.runtime.callsite.PogoMetaMethodSite.callCurrent(PogoMetaMethodSite.java:52)
        at org.codehaus.groovy.runtime.callsite.CallSiteArray.defaultCallCurrent(CallSiteArray.java:49)
        at org.codehaus.groovy.runtime.callsite.AbstractCallSite.callCurrent(AbstractCallSite.java:133)
        at org.codehaus.groovy.runtime.callsite.AbstractCallSite.callCurrent(AbstractCallSite.java:145)
        at gant.Gant.executeTargets(Gant.groovy:590)
        at org.codehaus.groovy.grails.cli.GrailsScriptRunner.executeWithGantInstance(GrailsScriptRunner.java:773)
        at org.codehaus.groovy.grails.cli.GrailsScriptRunner.executeScriptFile(GrailsScriptRunner.java:571)
        at org.codehaus.groovy.grails.cli.GrailsScriptRunner.executeScriptWithCaching(GrailsScriptRunner.java:470)
        at org.codehaus.groovy.grails.cli.GrailsScriptRunner.callPluginOrGrailsScript(GrailsScriptRunner.java:414)
        at org.codehaus.groovy.grails.cli.GrailsScriptRunner.executeCommand(GrailsScriptRunner.java:378)
        at org.codehaus.groovy.grails.cli.GrailsScriptRunner.main(GrailsScriptRunner.java:226)
        at sun.reflect.NativeMethodAccessorImpl.invoke0(Native Method)
        at sun.reflect.NativeMethodAccessorImpl.invoke(NativeMethodAccessorImpl.java:39)
        at sun.reflect.DelegatingMethodAccessorImpl.invoke(DelegatingMethodAccessorImpl.java:25)
        at java.lang.reflect.Method.invoke(Method.java:597)
        at org.codehaus.groovy.grails.cli.support.GrailsStarter.rootLoader(GrailsStarter.java:235)
        at org.codehaus.groovy.grails.cli.support.GrailsStarter.main(GrailsStarter.java:263)
        at sun.reflect.NativeMethodAccessorImpl.invoke0(Native Method)
        at sun.reflect.NativeMethodAccessorImpl.invoke(NativeMethodAccessorImpl.java:39)
        at sun.reflect.DelegatingMethodAccessorImpl.invoke(DelegatingMethodAccessorImpl.java:25)
        at java.lang.reflect.Method.invoke(Method.java:597)
        at com.intellij.rt.execution.application.AppMain.main(AppMain.java:120)
Caused by: java.lang.ClassNotFoundException: org.junit.internal.AssumptionViolatedException
        at java.net.URLClassLoader$1.run(URLClassLoader.java:202)
        at java.security.AccessController.doPrivileged(Native Method)
        at java.net.URLClassLoader.findClass(URLClassLoader.java:190)
        at java.lang.ClassLoader.loadClass(ClassLoader.java:306)
        at sun.misc.Launcher$AppClassLoader.loadClass(Launcher.java:301)
        at java.lang.ClassLoader.loadClass(ClassLoader.java:247)
        at org.codehaus.groovy.grails.cli.support.GrailsRootLoader.loadClass(GrailsRootLoader.java:54)
        at java.lang.ClassLoader.loadClass(ClassLoader.java:247)
        ... 297 more
| Error Error executing script TestApp: org/junit/internal/AssumptionViolatedException
Reply | Threaded
Open this post in threaded view
|

Re: 2.3.0 test-app throws AssumptionViolatedException

Amit Kapit
Update: upgrading to 2.3.1 did not change any thing.

Thanks.

Reply | Threaded
Open this post in threaded view
|

Re: 2.3.0 test-app throws AssumptionViolatedException

Graeme Rocher-2
Create a JIRA with an example attached that reproduces the issue

Cheers


On Fri, Oct 18, 2013 at 10:49 AM, Amit Kapit <[hidden email]> wrote:
Update: upgrading to 2.3.1 did not change any thing.

Thanks.





--
View this message in context: http://grails.1312388.n4.nabble.com/2-3-0-test-app-throws-AssumptionViolatedException-tp4650480p4650481.html
Sent from the Grails - user mailing list archive at Nabble.com.

---------------------------------------------------------------------
To unsubscribe from this list, please visit:

    http://xircles.codehaus.org/manage_email





--
Graeme Rocher
Grails Project Lead
SpringSource
Reply | Threaded
Open this post in threaded view
|

Re: 2.3.0 test-app throws AssumptionViolatedException

Amit Kapit
Trying on my production server did work. So I removed .grails on my local machine and tried again. It works now.

Thanks,

Amit.
Reply | Threaded
Open this post in threaded view
|

Re: 2.3.0 test-app throws AssumptionViolatedException

sergiomichels
I deleted .grails and the target folder, compiled all classes again but the problem persists.

My project have a lot of dependencies, so it's not easy reproducible. My dependency-report have 12000 lines - https://gist.github.com/sergiomichels/8418205

It seems to have only the version 4.11 of JUnit as dependency.

Any hints?



--
Sérgio Michels


On Fri, Oct 18, 2013 at 9:48 AM, Amit Kapit <[hidden email]> wrote:
Trying on my production server did work. So I removed .grails on my local
machine and tried again. It works now.

Thanks,

Amit.



--
View this message in context: http://grails.1312388.n4.nabble.com/2-3-0-test-app-throws-AssumptionViolatedException-tp4650480p4650488.html
Sent from the Grails - user mailing list archive at Nabble.com.

---------------------------------------------------------------------
To unsubscribe from this list, please visit:

    http://xircles.codehaus.org/manage_email



Reply | Threaded
Open this post in threaded view
|

Re: 2.3.0 test-app throws AssumptionViolatedException

sergiomichels
Digging a little more, it seems that it was a problem in Spring test 2.5.x: https://jira.springsource.org/browse/SPR-5145

But I didn't found any old spring-test jar in the dependency report.


--
Sérgio Michels


On Tue, Jan 14, 2014 at 11:22 AM, Sergio Michels <[hidden email]> wrote:
I deleted .grails and the target folder, compiled all classes again but the problem persists.

My project have a lot of dependencies, so it's not easy reproducible. My dependency-report have 12000 lines - https://gist.github.com/sergiomichels/8418205

It seems to have only the version 4.11 of JUnit as dependency.

Any hints?



--
Sérgio Michels


On Fri, Oct 18, 2013 at 9:48 AM, Amit Kapit <[hidden email]> wrote:
Trying on my production server did work. So I removed .grails on my local
machine and tried again. It works now.

Thanks,

Amit.



--
View this message in context: http://grails.1312388.n4.nabble.com/2-3-0-test-app-throws-AssumptionViolatedException-tp4650480p4650488.html
Sent from the Grails - user mailing list archive at Nabble.com.

---------------------------------------------------------------------
To unsubscribe from this list, please visit:

    http://xircles.codehaus.org/manage_email




Reply | Threaded
Open this post in threaded view
|

Re: 2.3.0 test-app throws AssumptionViolatedException

sergiomichels
Can anyone confirm the issue with this zip?

Here, if I change the grails.project.dependency.resolver to maven it works, but in my real application it will lead to other open issues.

--
Sérgio Michels


On Tue, Jan 14, 2014 at 1:06 PM, Sergio Michels <[hidden email]> wrote:
Digging a little more, it seems that it was a problem in Spring test 2.5.x: https://jira.springsource.org/browse/SPR-5145

But I didn't found any old spring-test jar in the dependency report.


--
Sérgio Michels


On Tue, Jan 14, 2014 at 11:22 AM, Sergio Michels <[hidden email]> wrote:
I deleted .grails and the target folder, compiled all classes again but the problem persists.

My project have a lot of dependencies, so it's not easy reproducible. My dependency-report have 12000 lines - https://gist.github.com/sergiomichels/8418205

It seems to have only the version 4.11 of JUnit as dependency.

Any hints?



--
Sérgio Michels


On Fri, Oct 18, 2013 at 9:48 AM, Amit Kapit <[hidden email]> wrote:
Trying on my production server did work. So I removed .grails on my local
machine and tried again. It works now.

Thanks,

Amit.



--
View this message in context: http://grails.1312388.n4.nabble.com/2-3-0-test-app-throws-AssumptionViolatedException-tp4650480p4650488.html
Sent from the Grails - user mailing list archive at Nabble.com.

---------------------------------------------------------------------
To unsubscribe from this list, please visit:

    http://xircles.codehaus.org/manage_email







---------------------------------------------------------------------
To unsubscribe from this list, please visit:

    http://xircles.codehaus.org/manage_email

test-hamcrest-core-bug-report-14012014.zip (34K) Download Attachment
Reply | Threaded
Open this post in threaded view
|

Re: 2.3.0 test-app throws AssumptionViolatedException

Lari Hotari -

I tried it and the tests passed after fixing the test (something = something.toUpperCase()).

Perhaps your ivy cache (~/.grails/ivy-cache for grails) is corrupted? Have you tried cleaning it?

btw. some tips regarding the junit dependency version issue, you can add a dependency to 'junit:junit-dep:4.11' to make sure that any junit-dep dependency is also using 4.11 version.
Somethings some dependency might have junit in compile scope dependencies and it's worth testing if adding a junit compile dependency helps at all.

Lari


14.01.2014 18:49, Sergio Michels wrote:
Can anyone confirm the issue with this zip?

Here, if I change the grails.project.dependency.resolver to maven it works, but in my real application it will lead to other open issues.

--
Sérgio Michels


On Tue, Jan 14, 2014 at 1:06 PM, Sergio Michels <[hidden email]> wrote:
Digging a little more, it seems that it was a problem in Spring test 2.5.x: https://jira.springsource.org/browse/SPR-5145

But I didn't found any old spring-test jar in the dependency report.


--
Sérgio Michels


On Tue, Jan 14, 2014 at 11:22 AM, Sergio Michels <[hidden email]> wrote:
I deleted .grails and the target folder, compiled all classes again but the problem persists.

My project have a lot of dependencies, so it's not easy reproducible. My dependency-report have 12000 lines - https://gist.github.com/sergiomichels/8418205

It seems to have only the version 4.11 of JUnit as dependency.

Any hints?



--
Sérgio Michels


On Fri, Oct 18, 2013 at 9:48 AM, Amit Kapit <[hidden email]> wrote:
Trying on my production server did work. So I removed .grails on my local
machine and tried again. It works now.

Thanks,

Amit.



--
View this message in context: http://grails.1312388.n4.nabble.com/2-3-0-test-app-throws-AssumptionViolatedException-tp4650480p4650488.html
Sent from the Grails - user mailing list archive at Nabble.com.

---------------------------------------------------------------------
To unsubscribe from this list, please visit:

    http://xircles.codehaus.org/manage_email







---------------------------------------------------------------------
To unsubscribe from this list, please visit:

    http://xircles.codehaus.org/manage_email

Reply | Threaded
Open this post in threaded view
|

Re: 2.3.0 test-app throws AssumptionViolatedException

sergiomichels
Hi Lari. Today I runned refresh-dependencies again and my test worked.

I'm suspecting that's something related to VPN, yesterday I was doing home office, and connected in the VPN to refresh the dependencies, because we have internal plugins. I don't know exactly what failed, since I did not get errors in the command, but doing it today (inside the company) it get solved. 


--
Sérgio Michels


On Wed, Jan 15, 2014 at 7:41 AM, Lari Hotari <[hidden email]> wrote:

I tried it and the tests passed after fixing the test (something = something.toUpperCase()).

Perhaps your ivy cache (~/.grails/ivy-cache for grails) is corrupted? Have you tried cleaning it?

btw. some tips regarding the junit dependency version issue, you can add a dependency to 'junit:junit-dep:4.11' to make sure that any junit-dep dependency is also using 4.11 version.
Somethings some dependency might have junit in compile scope dependencies and it's worth testing if adding a junit compile dependency helps at all.

Lari



14.01.2014 18:49, Sergio Michels wrote:
Can anyone confirm the issue with this zip?

Here, if I change the grails.project.dependency.resolver to maven it works, but in my real application it will lead to other open issues.

--
Sérgio Michels


On Tue, Jan 14, 2014 at 1:06 PM, Sergio Michels <[hidden email]> wrote:
Digging a little more, it seems that it was a problem in Spring test 2.5.x: https://jira.springsource.org/browse/SPR-5145

But I didn't found any old spring-test jar in the dependency report.


--
Sérgio Michels


On Tue, Jan 14, 2014 at 11:22 AM, Sergio Michels <[hidden email]> wrote:
I deleted .grails and the target folder, compiled all classes again but the problem persists.

My project have a lot of dependencies, so it's not easy reproducible. My dependency-report have 12000 lines - https://gist.github.com/sergiomichels/8418205

It seems to have only the version 4.11 of JUnit as dependency.

Any hints?



--
Sérgio Michels


On Fri, Oct 18, 2013 at 9:48 AM, Amit Kapit <[hidden email]> wrote:
Trying on my production server did work. So I removed .grails on my local
machine and tried again. It works now.

Thanks,

Amit.



--
View this message in context: http://grails.1312388.n4.nabble.com/2-3-0-test-app-throws-AssumptionViolatedException-tp4650480p4650488.html
Sent from the Grails - user mailing list archive at Nabble.com.

---------------------------------------------------------------------
To unsubscribe from this list, please visit:

    http://xircles.codehaus.org/manage_email







---------------------------------------------------------------------
To unsubscribe from this list, please visit:

    http://xircles.codehaus.org/manage_email