Quantcast

IllegalStateException: No WebApplicationContext found: no ContextLoaderListener registered?

Previous Topic Next Topic
 
classic Classic list List threaded Threaded
1 message Options
Reply | Threaded
Open this post in threaded view
|  
Report Content as Inappropriate

IllegalStateException: No WebApplicationContext found: no ContextLoaderListener registered?

Rommel Atienza
currently encountering below failure during prod test-app, current grails version is 2.5.3.

java.lang.IllegalStateException: No WebApplicationContext found: no ContextLoaderListener registered?
at grails.util.Holders.getApplicationContext(Holders.java:89)
at grails.test.spock.IntegrationSpec.$spock_initializeSharedFields(IntegrationSpec.groovy:41)

|Completed 0 spock test, 0 failed in 0m 0s
|Server stopped

does anyone know how to solve this?

thanks and regards in advace,
Romz

--
You received this message because you are subscribed to the Google Groups "Grails Dev Discuss" group.
To unsubscribe from this group and stop receiving emails from it, send an email to [hidden email].
To post to this group, send email to [hidden email].
To view this discussion on the web visit https://groups.google.com/d/msgid/grails-dev-discuss/7e2f0be7-e801-4026-818e-a3201824b820%40googlegroups.com.
For more options, visit https://groups.google.com/d/optout.
Loading...