Quantcast

gradle build of grails-data-mapping 2.5.x fails tests

Previous Topic Next Topic
 
classic Classic list List threaded Threaded
3 messages Options
Reply | Threaded
Open this post in threaded view
|  
Report Content as Inappropriate

gradle build of grails-data-mapping 2.5.x fails tests

John Pandich
Hello, 

I am attempting to back fit https://github.com/grails/grails-data-mapping/commit/7415062050ea1a21a9c0650d2a22d6f1608af4fe to Grails 2.5 but I have run into a problem building (even without my changes in a vanilla 2.5 build). Any input would be greatly appreciated.
Here is what I am seeing:

The groovy configuration has been deprecated and is scheduled to be removed in Gradle 2.0. Typically, usages of 'groovy' can simply be replaced with 'compile'. In some cases, it may be necessary to additionally configure the 'groovyClasspath' property of GroovyCompile and Groovydoc tasks.
:grails-datastore-core:compileJava UP-TO-DATE
:grails-datastore-core:compileGroovy UP-TO-DATE
:grails-datastore-core:processResources UP-TO-DATE
:grails-datastore-core:classes UP-TO-DATE
:grails-datastore-core:jar UP-TO-DATE
:grails-datastore-core:javadoc UP-TO-DATE
:grails-datastore-core:javadocJar UP-TO-DATE
:grails-datastore-core:sourcesJar UP-TO-DATE
:grails-datastore-core:signArchives SKIPPED
:grails-datastore-core:assemble UP-TO-DATE
:grails-datastore-core:compileTestJava UP-TO-DATE
:grails-datastore-core:compileTestGroovy UP-TO-DATE
:grails-datastore-core:processTestResources UP-TO-DATE
:grails-datastore-core:testClasses UP-TO-DATE
:grails-datastore-core:test UP-TO-DATE
:grails-datastore-core:check UP-TO-DATE
:grails-datastore-core:build UP-TO-DATE
:grails-datastore-dynamodb:compileJava UP-TO-DATE
:grails-datastore-dynamodb:compileGroovy UP-TO-DATE
:grails-datastore-dynamodb:processResources UP-TO-DATE
:grails-datastore-dynamodb:classes UP-TO-DATE
:grails-datastore-dynamodb:jar UP-TO-DATE
:grails-datastore-dynamodb:javadoc UP-TO-DATE
:grails-datastore-dynamodb:javadocJar UP-TO-DATE
:grails-datastore-dynamodb:sourcesJar UP-TO-DATE
:grails-datastore-dynamodb:signArchives SKIPPED
:grails-datastore-dynamodb:assemble UP-TO-DATE
:grails-datastore-dynamodb:compileTestJava UP-TO-DATE
:grails-datastore-dynamodb:compileTestGroovy UP-TO-DATE
:grails-datastore-dynamodb:processTestResources UP-TO-DATE
:grails-datastore-dynamodb:testClasses UP-TO-DATE
:grails-datastore-dynamodb:test UP-TO-DATE
:grails-datastore-dynamodb:check UP-TO-DATE
:grails-datastore-dynamodb:build UP-TO-DATE
:grails-datastore-gemfire:compileJava UP-TO-DATE
:grails-datastore-gemfire:compileGroovy UP-TO-DATE
:grails-datastore-gemfire:processResources UP-TO-DATE
:grails-datastore-gemfire:classes UP-TO-DATE
:grails-datastore-gemfire:jar UP-TO-DATE
:grails-datastore-gemfire:javadoc UP-TO-DATE
:grails-datastore-gemfire:javadocJar UP-TO-DATE
:grails-datastore-gemfire:sourcesJar UP-TO-DATE
:grails-datastore-gemfire:signArchives SKIPPED
:grails-datastore-gemfire:assemble UP-TO-DATE
:grails-datastore-gemfire:compileTestJava UP-TO-DATE
:grails-datastore-gemfire:compileTestGroovy UP-TO-DATE
:grails-datastore-gemfire:processTestResources UP-TO-DATE
:grails-datastore-gemfire:testClasses UP-TO-DATE
:grails-datastore-gemfire:test UP-TO-DATE
:grails-datastore-gemfire:check UP-TO-DATE
:grails-datastore-gemfire:build UP-TO-DATE
:grails-datastore-gorm:compileJava UP-TO-DATE
:grails-datastore-gorm:compileGroovy UP-TO-DATE
:grails-datastore-gorm:processResources UP-TO-DATE
:grails-datastore-gorm:classes UP-TO-DATE
:grails-datastore-gorm:jar UP-TO-DATE
:grails-datastore-gorm:javadoc UP-TO-DATE
:grails-datastore-gorm:javadocJar UP-TO-DATE
:grails-datastore-gorm:sourcesJar UP-TO-DATE
:grails-datastore-gorm:signArchives SKIPPED
:grails-datastore-gorm:assemble UP-TO-DATE
:grails-datastore-gorm:compileTestJava UP-TO-DATE
:grails-datastore-gorm:compileTestGroovy UP-TO-DATE
:grails-datastore-gorm:processTestResources UP-TO-DATE
:grails-datastore-gorm:testClasses UP-TO-DATE
:grails-datastore-gorm:test UP-TO-DATE
:grails-datastore-gorm:check UP-TO-DATE
:grails-datastore-gorm:build UP-TO-DATE
:grails-datastore-web:compileJava UP-TO-DATE
:grails-datastore-web:compileGroovy UP-TO-DATE
:grails-datastore-web:processResources UP-TO-DATE
:grails-datastore-web:classes UP-TO-DATE
:grails-datastore-web:jar UP-TO-DATE
:grails-datastore-gorm-plugin-support:compileJava UP-TO-DATE
:grails-datastore-gorm-plugin-support:compileGroovy UP-TO-DATE
:grails-datastore-gorm-plugin-support:processResources UP-TO-DATE
:grails-datastore-gorm-plugin-support:classes UP-TO-DATE
:grails-datastore-gorm-plugin-support:jar UP-TO-DATE
:grails-datastore-gorm-dynamodb:compileJava UP-TO-DATE
:grails-datastore-gorm-dynamodb:compileGroovy UP-TO-DATE
:grails-datastore-gorm-dynamodb:processResources UP-TO-DATE
:grails-datastore-gorm-dynamodb:classes UP-TO-DATE
:grails-datastore-gorm-dynamodb:jar UP-TO-DATE
:grails-datastore-web:javadoc UP-TO-DATE
:grails-datastore-gorm-plugin-support:javadoc UP-TO-DATE
:grails-datastore-gorm-dynamodb:javadoc UP-TO-DATE
:grails-datastore-gorm-dynamodb:javadocJar UP-TO-DATE
:grails-datastore-gorm-dynamodb:sourcesJar UP-TO-DATE
:grails-datastore-gorm-dynamodb:signArchives SKIPPED
:grails-datastore-gorm-dynamodb:assemble UP-TO-DATE
:grails-datastore-gorm-tck:compileJava UP-TO-DATE
:grails-datastore-gorm-tck:compileGroovy UP-TO-DATE
:grails-datastore-gorm-tck:processResources UP-TO-DATE
:grails-datastore-gorm-tck:classes UP-TO-DATE
:grails-datastore-gorm-tck:jar UP-TO-DATE
:grails-datastore-simple:compileJava UP-TO-DATE
:grails-datastore-simple:compileGroovy UP-TO-DATE
:grails-datastore-simple:processResources UP-TO-DATE
:grails-datastore-simple:classes UP-TO-DATE
:grails-datastore-simple:jar UP-TO-DATE
:grails-datastore-gorm-test:compileJava UP-TO-DATE
:grails-datastore-gorm-test:compileGroovy UP-TO-DATE
:grails-datastore-gorm-test:processResources UP-TO-DATE
:grails-datastore-gorm-test:classes UP-TO-DATE
:grails-datastore-gorm-test:jar UP-TO-DATE
:grails-datastore-gorm-dynamodb:compileTestJava UP-TO-DATE
:grails-datastore-gorm-dynamodb:compileTestGroovy UP-TO-DATE
:grails-datastore-gorm-dynamodb:processTestResources UP-TO-DATE
:grails-datastore-gorm-dynamodb:testClasses UP-TO-DATE
:grails-datastore-gorm-dynamodb:test

grails.gorm.tests.DynamoDBHiloSpec > Test one FAILED
    java.lang.IllegalArgumentException

grails.gorm.tests.DynamoDBHiloSpec > Test multiple FAILED
    java.lang.IllegalArgumentException

grails.gorm.tests.QueryAfterPropertyChangeSpec > Test that an entity is de-indexed after a change to an indexed property FAILED
    java.lang.IllegalArgumentException

grails.gorm.tests.SessionPropertiesSpec > test session properties FAILED
    java.lang.IllegalArgumentException

grails.gorm.tests.GroovyProxySpec > Test proxying of non-existent instance throws an exception FAILED
    java.lang.IllegalArgumentException

grails.gorm.tests.GroovyProxySpec > Test creation and behavior of Groovy proxies FAILED
    java.lang.IllegalArgumentException

grails.gorm.tests.ValidationSpec > Test disable validation FAILED
    java.lang.IllegalArgumentException

grails.gorm.tests.ValidationSpec > Test validate() method FAILED
    java.lang.IllegalArgumentException

grails.gorm.tests.ValidationSpec > Test that validate is called on save() FAILED
    java.lang.IllegalArgumentException

grails.gorm.tests.ValidationSpec > Test beforeValidate gets called on save() FAILED
    java.lang.IllegalArgumentException

grails.gorm.tests.ValidationSpec > Test beforeValidate gets called on validate() FAILED
    java.lang.IllegalArgumentException

grails.gorm.tests.ValidationSpec > Test beforeValidate gets called on validate() and passing a list of field names to validate FAILED
    java.lang.IllegalArgumentException

grails.gorm.tests.ValidationSpec > Test that validate works without a bound Session FAILED
    java.lang.IllegalArgumentException

grails.gorm.tests.FindOrSaveWhereSpec > Test findOrSaveWhere returns a new instance if it doesn't exist in the database FAILED
    java.lang.IllegalArgumentException

grails.gorm.tests.FindOrSaveWhereSpec > Test findOrSaveWhere returns a persistent instance if it exists in the database FAILED
    java.lang.IllegalArgumentException

grails.gorm.tests.CriteriaBuilderSpec > Test idEq method FAILED
    java.lang.IllegalArgumentException

grails.gorm.tests.CriteriaBuilderSpec > Test disjunction query FAILED
    java.lang.IllegalArgumentException

grails.gorm.tests.CriteriaBuilderSpec > Test conjunction query FAILED
    java.lang.IllegalArgumentException

grails.gorm.tests.CriteriaBuilderSpec > Test list() query FAILED
    java.lang.IllegalArgumentException

grails.gorm.tests.CriteriaBuilderSpec > Test count() FAILED
    java.lang.IllegalArgumentException

grails.gorm.tests.CriteriaBuilderSpec > Test obtain a single result FAILED
    java.lang.IllegalArgumentException

grails.gorm.tests.CriteriaBuilderSpec > Test order by a property name FAILED
    java.lang.IllegalArgumentException

grails.gorm.tests.QueryByAssociationSpec > Test query entity by single-ended association FAILED
    java.lang.IllegalArgumentException

grails.gorm.tests.WithTransactionSpec > Test save() with transaction FAILED
    java.lang.IllegalArgumentException

grails.gorm.tests.WithTransactionSpec > Test rollback transaction FAILED
    java.lang.IllegalArgumentException

grails.gorm.tests.WithTransactionSpec > Test rollback transaction with Runtime Exception FAILED
    java.lang.IllegalArgumentException

grails.gorm.tests.WithTransactionSpec > Test rollback transaction with Exception FAILED
    java.lang.IllegalArgumentException

grails.gorm.tests.FindByExampleSpec > Test findAll by example FAILED
    java.lang.IllegalArgumentException

grails.gorm.tests.FindByExampleSpec > Test find by example FAILED
    java.lang.IllegalArgumentException

grails.gorm.tests.FindOrCreateWhereSpec > Test findOrCreateWhere returns a new instance if it doesn't exist in the database FAILED
    java.lang.IllegalArgumentException

grails.gorm.tests.FindOrCreateWhereSpec > Test findOrCreateWhere returns a persistent instance if it exists in the database FAILED
    java.lang.IllegalArgumentException

grails.gorm.tests.OneToManySpec > test save and return unidirectional one to many FAILED
    java.lang.IllegalArgumentException

grails.gorm.tests.OneToManySpec > test save and return bidirectional one to many FAILED
    java.lang.IllegalArgumentException

grails.gorm.tests.OneToManySpec > test update inverse side of bidirectional one to many collection FAILED
    java.lang.IllegalArgumentException

grails.gorm.tests.OneToManySpec > test update inverse side of bidirectional one to many happens before flushing the session FAILED
    java.lang.IllegalArgumentException

grails.gorm.tests.OneToManySpec > Test persist of association with proxy FAILED
    java.lang.IllegalArgumentException

grails.gorm.tests.CommonTypesPersistenceSpec > testPersistBasicTypes FAILED
    java.lang.IllegalArgumentException

grails.gorm.tests.OrderBySpec > Test order with criteria FAILED
    java.lang.IllegalArgumentException

grails.gorm.tests.OrderBySpec > Test order by with list() method FAILED
    java.lang.IllegalArgumentException

grails.gorm.tests.OrderBySpec > Test order by property name with dynamic finder FAILED
    java.lang.IllegalArgumentException

grails.gorm.tests.DomainEventsSpec > Test that returning false from beforeUpdate evicts the event FAILED
    java.lang.IllegalArgumentException
    java.lang.NullPointerException at DomainEventsSpec.groovy:295

grails.gorm.tests.DomainEventsSpec > Test that returning false from beforeInsert evicts the event FAILED
    java.lang.IllegalArgumentException
    java.lang.NullPointerException at DomainEventsSpec.groovy:295

grails.gorm.tests.DomainEventsSpec > Test that returning false from beforeDelete evicts the event FAILED
    java.lang.IllegalArgumentException
    java.lang.NullPointerException at DomainEventsSpec.groovy:295

grails.gorm.tests.DomainEventsSpec > Test modify property before save FAILED
    java.lang.IllegalArgumentException
    java.lang.NullPointerException at DomainEventsSpec.groovy:295

grails.gorm.tests.DomainEventsSpec > Test auto time stamping working FAILED
    java.lang.IllegalArgumentException
    java.lang.NullPointerException at DomainEventsSpec.groovy:295

grails.gorm.tests.DomainEventsSpec > Test delete events FAILED
    java.lang.IllegalArgumentException
    java.lang.NullPointerException at DomainEventsSpec.groovy:295

grails.gorm.tests.DomainEventsSpec > Test multi-delete events FAILED
    java.lang.IllegalArgumentException
    java.lang.NullPointerException at DomainEventsSpec.groovy:295

grails.gorm.tests.DomainEventsSpec > Test before update event FAILED
    java.lang.IllegalArgumentException
    java.lang.NullPointerException at DomainEventsSpec.groovy:295

grails.gorm.tests.DomainEventsSpec > Test insert events FAILED
    java.lang.IllegalArgumentException
    java.lang.NullPointerException at DomainEventsSpec.groovy:295

grails.gorm.tests.DomainEventsSpec > Test load events FAILED
    java.lang.IllegalArgumentException
    java.lang.NullPointerException at DomainEventsSpec.groovy:295

grails.gorm.tests.DomainEventsSpec > Test multi-load events FAILED
    java.lang.IllegalArgumentException
    java.lang.NullPointerException at DomainEventsSpec.groovy:295

grails.gorm.tests.NegationSpec > Test negation in dynamic finder FAILED
    java.lang.IllegalArgumentException

grails.gorm.tests.NegationSpec > Test simple negation in criteria FAILED
    java.lang.IllegalArgumentException

grails.gorm.tests.NamedQuerySpec > Test named query with disjunction FAILED
    java.lang.IllegalArgumentException

grails.gorm.tests.NamedQuerySpec > Test max and offset parameter FAILED
    java.lang.IllegalArgumentException

grails.gorm.tests.NamedQuerySpec > Test that parameter to get is converted FAILED
    java.lang.IllegalArgumentException

grails.gorm.tests.NamedQuerySpec > Test named query with additional criteria closure FAILED
    java.lang.IllegalArgumentException

grails.gorm.tests.NamedQuerySpec > Test passing parameters to additional criteria FAILED
    java.lang.IllegalArgumentException

grails.gorm.tests.NamedQuerySpec > Test get method followed named query chaining FAILED
    java.lang.IllegalArgumentException

grails.gorm.tests.NamedQuerySpec > Test named query with findBy*() dynamic finder FAILED
    java.lang.IllegalArgumentException

grails.gorm.tests.NamedQuerySpec > Test named query with findAllBy*() dyamic finder FAILED
    java.lang.IllegalArgumentException

grails.gorm.tests.NamedQuerySpec > Test uniqueResult FAILED
    java.lang.IllegalArgumentException

grails.gorm.tests.NamedQuerySpec > Test findWhere method after chaining named queries FAILED
    java.lang.IllegalArgumentException

grails.gorm.tests.NamedQuerySpec > Test named query passing multiple parameters to a nested query FAILED
    java.lang.IllegalArgumentException

grails.gorm.tests.NamedQuerySpec > Test chaining named queries FAILED
    java.lang.IllegalArgumentException

grails.gorm.tests.NamedQuerySpec > Test referencing named query before any dynamic methods FAILED
    java.lang.IllegalArgumentException

grails.gorm.tests.NamedQuerySpec > Test named query with conjunction FAILED
    java.lang.IllegalArgumentException

grails.gorm.tests.NamedQuerySpec > Test named query with list() method FAILED
    java.lang.IllegalArgumentException

grails.gorm.tests.NamedQuerySpec > Test named query with countBy*() dynamic finder FAILED
    java.lang.IllegalArgumentException

grails.gorm.tests.NamedQuerySpec > Test get with id of object which does not match criteria FAILED
    java.lang.IllegalArgumentException

grails.gorm.tests.NamedQuerySpec > Test get method returns correct object FAILED
    java.lang.IllegalArgumentException

grails.gorm.tests.NamedQuerySpec > Test get method returns null FAILED
    java.lang.IllegalArgumentException

grails.gorm.tests.NamedQuerySpec > Test count method following named criteria FAILED
    java.lang.IllegalArgumentException

grails.gorm.tests.NamedQuerySpec > Test count with parameterized named query FAILED
    java.lang.IllegalArgumentException

grails.gorm.tests.NamedQuerySpec > Test max parameter FAILED
    java.lang.IllegalArgumentException

grails.gorm.tests.NamedQuerySpec > Test max results FAILED
    java.lang.IllegalArgumentException

grails.gorm.tests.NamedQuerySpec > Test findAllWhere method combined with named query FAILED
    java.lang.IllegalArgumentException

grails.gorm.tests.NamedQuerySpec > Test findAllWhere method with named query and disjunction FAILED
    java.lang.IllegalArgumentException

grails.gorm.tests.NamedQuerySpec > Test get with parameterized named query FAILED
    java.lang.IllegalArgumentException

grails.gorm.tests.NamedQuerySpec > Test named query with one parameter FAILED
    java.lang.IllegalArgumentException

grails.gorm.tests.NamedQuerySpec > Test named query with multiple parameters FAILED
    java.lang.IllegalArgumentException

grails.gorm.tests.NamedQuerySpec > Test named query with multiple parameters and dynamic finder FAILED
    java.lang.IllegalArgumentException

grails.gorm.tests.NamedQuerySpec > Test named query with multiple parameters and map FAILED
    java.lang.IllegalArgumentException

grails.gorm.tests.NamedQuerySpec > Test findWhere with named query FAILED
    java.lang.IllegalArgumentException

grails.gorm.tests.LexComparisonSpec > Test byte comparison FAILED
    java.lang.IllegalArgumentException

grails.gorm.tests.LexComparisonSpec > Test short comparison FAILED
    java.lang.IllegalArgumentException

grails.gorm.tests.LexComparisonSpec > Test integer comparison FAILED
    java.lang.IllegalArgumentException

grails.gorm.tests.LexComparisonSpec > Test long comparison FAILED
    java.lang.IllegalArgumentException

grails.gorm.tests.DisableAutotimeStampSpec > Test that when auto timestamping is disabled the dateCreated and lastUpdated properties are not set FAILED
    java.lang.IllegalArgumentException

grails.gorm.tests.OneToOneSpec > Test persist and retrieve unidirectional many-to-one FAILED
    java.lang.IllegalArgumentException

grails.gorm.tests.OneToOneSpec > Test persist and retrieve one-to-one with inverse key FAILED
    java.lang.IllegalArgumentException

grails.gorm.tests.PersistenceEventListenerSpec > Test delete events FAILED
    java.lang.IllegalArgumentException

grails.gorm.tests.PersistenceEventListenerSpec > Test multi-delete events FAILED
    java.lang.IllegalArgumentException

grails.gorm.tests.PersistenceEventListenerSpec > Test update events FAILED
    java.lang.IllegalArgumentException

grails.gorm.tests.PersistenceEventListenerSpec > Test insert events FAILED
    java.lang.IllegalArgumentException

grails.gorm.tests.PersistenceEventListenerSpec > Test load events FAILED
    java.lang.IllegalArgumentException

grails.gorm.tests.PersistenceEventListenerSpec > Test multi-load events FAILED
    java.lang.IllegalArgumentException

grails.gorm.tests.PersistenceEventListenerSpec > Test validation events FAILED
    java.lang.IllegalArgumentException

grails.gorm.tests.UniqueConstraintSpec > Test simple unique constraint FAILED
    java.lang.IllegalArgumentException

grails.gorm.tests.UniqueConstraintSpec > should update to a existing value fail FAILED
    java.lang.IllegalArgumentException

grails.gorm.tests.UniqueConstraintSpec > withManualFlushMode should use flushmode commit FAILED
    java.lang.IllegalArgumentException

grails.gorm.tests.GormEnhancerSpec > Test basic CRUD operations FAILED
    java.lang.IllegalArgumentException

grails.gorm.tests.GormEnhancerSpec > Test simple dynamic finder FAILED
    java.lang.IllegalArgumentException

grails.gorm.tests.GormEnhancerSpec > Test dynamic finder with disjunction FAILED
    java.lang.IllegalArgumentException

grails.gorm.tests.GormEnhancerSpec > Test getAll() method FAILED
    java.lang.IllegalArgumentException

grails.gorm.tests.GormEnhancerSpec > Test ident() method FAILED
    java.lang.IllegalArgumentException

grails.gorm.tests.GormEnhancerSpec > Test dynamic finder with pagination parameters FAILED
    java.lang.IllegalArgumentException

grails.gorm.tests.GormEnhancerSpec > Test in list query FAILED
    java.lang.IllegalArgumentException

grails.gorm.tests.GormEnhancerSpec > Test like query FAILED
    java.lang.IllegalArgumentException

grails.gorm.tests.GormEnhancerSpec > Test count by query FAILED
    java.lang.IllegalArgumentException

grails.gorm.tests.GormEnhancerSpec > Test dynamic finder with conjunction FAILED
    java.lang.IllegalArgumentException

grails.gorm.tests.GormEnhancerSpec > Test count() method FAILED
    java.lang.IllegalArgumentException

grails.gorm.tests.InheritanceSpec > Test inheritance with dynamic finder FAILED
    java.lang.IllegalArgumentException

grails.gorm.tests.QueryByNullSpec > Test passing null as the sole argument to a dynamic finder multiple times FAILED
    java.lang.IllegalArgumentException

grails.gorm.tests.RangeQuerySpec > Test between query with dates FAILED
    java.lang.IllegalArgumentException

grails.gorm.tests.RangeQuerySpec > Test between query FAILED
    java.lang.IllegalArgumentException

grails.gorm.tests.RangeQuerySpec > Test greater than or equal to and less than or equal to queries FAILED
    java.lang.IllegalArgumentException

grails.gorm.tests.RangeQuerySpec > Test InRange Dynamic Finder FAILED
    java.lang.IllegalArgumentException

grails.gorm.tests.AttachMethodSpec > Test attach method FAILED
    java.lang.IllegalArgumentException

grails.gorm.tests.DeleteAllSpec > Test that many objects can be deleted at once using multiple arguments FAILED
    java.lang.IllegalArgumentException

grails.gorm.tests.DeleteAllSpec > Test that many objects can be deleted using an iterable FAILED
    java.lang.IllegalArgumentException

grails.gorm.tests.CrudOperationsSpec > Test get using a string-based key FAILED
    java.lang.IllegalArgumentException

grails.gorm.tests.CrudOperationsSpec > Test get returns null of non-existent entity FAILED
    java.lang.IllegalArgumentException

grails.gorm.tests.CrudOperationsSpec > Test basic CRUD operations FAILED
    java.lang.IllegalArgumentException

grails.gorm.tests.CrudOperationsSpec > Test save method that takes a map FAILED
    java.lang.IllegalArgumentException

grails.gorm.tests.CrudOperationsSpec > Test failOnError FAILED
    java.lang.IllegalArgumentException

grails.gorm.tests.UpdateWithProxyPresentSpec > Test update entity with association proxies FAILED
    java.lang.IllegalArgumentException

grails.gorm.tests.UpdateWithProxyPresentSpec > Test update unidirectional oneToMany with proxy FAILED
    java.lang.IllegalArgumentException

grails.gorm.tests.CircularOneToManySpec > Test circular one-to-many FAILED
    java.lang.IllegalArgumentException

grails.gorm.tests.MultilineValueSpec > Test multivalue with slash n FAILED
    java.lang.IllegalArgumentException

grails.gorm.tests.MultilineValueSpec > Test multivalue with slash r slash n FAILED
    java.lang.IllegalArgumentException

grails.gorm.tests.EnumSpec > Test save() FAILED
    java.lang.IllegalArgumentException

grails.gorm.tests.EnumSpec > Test findByInList() FAILED
    java.lang.IllegalArgumentException

grails.gorm.tests.EnumSpec > Test findBy() FAILED
    java.lang.IllegalArgumentException

grails.gorm.tests.EnumSpec > Test findBy() with clearing the session FAILED
    java.lang.IllegalArgumentException

grails.gorm.tests.EnumSpec > Test findAllBy() FAILED
    java.lang.IllegalArgumentException

grails.gorm.tests.EnumSpec > Test countBy() FAILED
    java.lang.IllegalArgumentException

grails.gorm.tests.OptimisticLockingSpec > Test versioning FAILED
    java.lang.IllegalArgumentException

grails.gorm.tests.OptimisticLockingSpec > Test optimistic locking FAILED
    java.lang.IllegalArgumentException

grails.gorm.tests.OptimisticLockingSpec > Test optimistic locking disabled with 'version false' FAILED
    java.lang.IllegalArgumentException

grails.gorm.tests.ListOrderBySpec > Test listOrderBy property name method FAILED
    java.lang.IllegalArgumentException

grails.gorm.tests.ConstraintsSpec > Test constraints with static default values FAILED
    java.lang.IllegalArgumentException

grails.gorm.tests.FindByMethodSpec > Test Using AND Multiple Times In A Dynamic Finder FAILED
    java.lang.IllegalArgumentException

grails.gorm.tests.FindByMethodSpec > Test Using OR Multiple Times In A Dynamic Finder FAILED
    java.lang.IllegalArgumentException

grails.gorm.tests.FindByMethodSpec > testBooleanPropertyQuery FAILED
    java.lang.IllegalArgumentException

grails.gorm.tests.FindByMethodSpec > Test findOrCreateBy For A Record That Does Not Exist In The Database FAILED
    java.lang.IllegalArgumentException

grails.gorm.tests.FindByMethodSpec > Test findOrCreateBy With An AND Clause FAILED
    java.lang.IllegalArgumentException

grails.gorm.tests.FindByMethodSpec > Test findOrCreateBy Throws Exception If An OR Clause Is Used FAILED
    java.lang.IllegalArgumentException

grails.gorm.tests.FindByMethodSpec > Test findOrSaveBy For A Record That Does Not Exist In The Database FAILED
    java.lang.IllegalArgumentException

grails.gorm.tests.FindByMethodSpec > Test findOrSaveBy For A Record That Does Exist In The Database FAILED
    java.lang.IllegalArgumentException

grails.gorm.tests.FindByMethodSpec > Test patterns which shold throw MissingMethodException FAILED
    java.lang.IllegalArgumentException

grails.gorm.tests.ProxyLoadingSpec > Test load proxied instance directly FAILED
    java.lang.IllegalArgumentException

grails.gorm.tests.ProxyLoadingSpec > Test query using proxied association FAILED
    java.lang.IllegalArgumentException

grails.gorm.tests.SaveAllSpec > Test that many objects can be saved at once using multiple arguments FAILED
    java.lang.IllegalArgumentException

grails.gorm.tests.SaveAllSpec > Test that many objects can be saved at once using a list FAILED
    java.lang.IllegalArgumentException

grails.gorm.tests.SaveAllSpec > Test that many objects can be saved at once using an iterable FAILED
    java.lang.IllegalArgumentException

169 tests completed, 156 failed, 9 skipped
:grails-datastore-gorm-dynamodb:test FAILED

FAILURE: Build failed with an exception.

* What went wrong:
Execution failed for task ':grails-datastore-gorm-dynamodb:test'.
> There were failing tests. See the report at: file:///home/john/builds/grails/grails-data-mapping/grails-datastore-gorm-dynamodb/build/reports/tests/index.html

* Try:
Run with --stacktrace option to get the stack trace. Run with --info or --debug option to get more log output.

BUILD FAILED

Total time: 15.001 secs

--
You received this message because you are subscribed to the Google Groups "Grails Dev Discuss" group.
To unsubscribe from this group and stop receiving emails from it, send an email to [hidden email].
To post to this group, send email to [hidden email].
To view this discussion on the web visit https://groups.google.com/d/msgid/grails-dev-discuss/f0541063-d856-49bd-9e13-c8d3049d82fc%40googlegroups.com.
For more options, visit https://groups.google.com/d/optout.
Reply | Threaded
Open this post in threaded view
|  
Report Content as Inappropriate

Re: gradle build of grails-data-mapping 2.5.x fails tests

Jeff Brown
Unless you are working on dynamo stuff in particular, you probably want to exclude the dynamo tests from your local build with something like “-x :grails-datastore-gorm-dynamodb:test”



JSB

> On Mar 10, 2016, at 12:07 PM, John Pandich <[hidden email]> wrote:
>
> Hello,
>
> I am attempting to back fit https://github.com/grails/grails-data-mapping/commit/7415062050ea1a21a9c0650d2a22d6f1608af4fe to Grails 2.5 but I have run into a problem building (even without my changes in a vanilla 2.5 build). Any input would be greatly appreciated.
> Here is what I am seeing:
>
> The groovy configuration has been deprecated and is scheduled to be removed in Gradle 2.0. Typically, usages of 'groovy' can simply be replaced with 'compile'. In some cases, it may be necessary to additionally configure the 'groovyClasspath' property of GroovyCompile and Groovydoc tasks.
> :grails-datastore-core:compileJava UP-TO-DATE
> :grails-datastore-core:compileGroovy UP-TO-DATE
> :grails-datastore-core:processResources UP-TO-DATE
> :grails-datastore-core:classes UP-TO-DATE
> :grails-datastore-core:jar UP-TO-DATE
> :grails-datastore-core:javadoc UP-TO-DATE
> :grails-datastore-core:javadocJar UP-TO-DATE
> :grails-datastore-core:sourcesJar UP-TO-DATE
> :grails-datastore-core:signArchives SKIPPED
> :grails-datastore-core:assemble UP-TO-DATE
> :grails-datastore-core:compileTestJava UP-TO-DATE
> :grails-datastore-core:compileTestGroovy UP-TO-DATE
> :grails-datastore-core:processTestResources UP-TO-DATE
> :grails-datastore-core:testClasses UP-TO-DATE
> :grails-datastore-core:test UP-TO-DATE
> :grails-datastore-core:check UP-TO-DATE
> :grails-datastore-core:build UP-TO-DATE
> :grails-datastore-dynamodb:compileJava UP-TO-DATE
> :grails-datastore-dynamodb:compileGroovy UP-TO-DATE
> :grails-datastore-dynamodb:processResources UP-TO-DATE
> :grails-datastore-dynamodb:classes UP-TO-DATE
> :grails-datastore-dynamodb:jar UP-TO-DATE
> :grails-datastore-dynamodb:javadoc UP-TO-DATE
> :grails-datastore-dynamodb:javadocJar UP-TO-DATE
> :grails-datastore-dynamodb:sourcesJar UP-TO-DATE
> :grails-datastore-dynamodb:signArchives SKIPPED
> :grails-datastore-dynamodb:assemble UP-TO-DATE
> :grails-datastore-dynamodb:compileTestJava UP-TO-DATE
> :grails-datastore-dynamodb:compileTestGroovy UP-TO-DATE
> :grails-datastore-dynamodb:processTestResources UP-TO-DATE
> :grails-datastore-dynamodb:testClasses UP-TO-DATE
> :grails-datastore-dynamodb:test UP-TO-DATE
> :grails-datastore-dynamodb:check UP-TO-DATE
> :grails-datastore-dynamodb:build UP-TO-DATE
> :grails-datastore-gemfire:compileJava UP-TO-DATE
> :grails-datastore-gemfire:compileGroovy UP-TO-DATE
> :grails-datastore-gemfire:processResources UP-TO-DATE
> :grails-datastore-gemfire:classes UP-TO-DATE
> :grails-datastore-gemfire:jar UP-TO-DATE
> :grails-datastore-gemfire:javadoc UP-TO-DATE
> :grails-datastore-gemfire:javadocJar UP-TO-DATE
> :grails-datastore-gemfire:sourcesJar UP-TO-DATE
> :grails-datastore-gemfire:signArchives SKIPPED
> :grails-datastore-gemfire:assemble UP-TO-DATE
> :grails-datastore-gemfire:compileTestJava UP-TO-DATE
> :grails-datastore-gemfire:compileTestGroovy UP-TO-DATE
> :grails-datastore-gemfire:processTestResources UP-TO-DATE
> :grails-datastore-gemfire:testClasses UP-TO-DATE
> :grails-datastore-gemfire:test UP-TO-DATE
> :grails-datastore-gemfire:check UP-TO-DATE
> :grails-datastore-gemfire:build UP-TO-DATE
> :grails-datastore-gorm:compileJava UP-TO-DATE
> :grails-datastore-gorm:compileGroovy UP-TO-DATE
> :grails-datastore-gorm:processResources UP-TO-DATE
> :grails-datastore-gorm:classes UP-TO-DATE
> :grails-datastore-gorm:jar UP-TO-DATE
> :grails-datastore-gorm:javadoc UP-TO-DATE
> :grails-datastore-gorm:javadocJar UP-TO-DATE
> :grails-datastore-gorm:sourcesJar UP-TO-DATE
> :grails-datastore-gorm:signArchives SKIPPED
> :grails-datastore-gorm:assemble UP-TO-DATE
> :grails-datastore-gorm:compileTestJava UP-TO-DATE
> :grails-datastore-gorm:compileTestGroovy UP-TO-DATE
> :grails-datastore-gorm:processTestResources UP-TO-DATE
> :grails-datastore-gorm:testClasses UP-TO-DATE
> :grails-datastore-gorm:test UP-TO-DATE
> :grails-datastore-gorm:check UP-TO-DATE
> :grails-datastore-gorm:build UP-TO-DATE
> :grails-datastore-web:compileJava UP-TO-DATE
> :grails-datastore-web:compileGroovy UP-TO-DATE
> :grails-datastore-web:processResources UP-TO-DATE
> :grails-datastore-web:classes UP-TO-DATE
> :grails-datastore-web:jar UP-TO-DATE
> :grails-datastore-gorm-plugin-support:compileJava UP-TO-DATE
> :grails-datastore-gorm-plugin-support:compileGroovy UP-TO-DATE
> :grails-datastore-gorm-plugin-support:processResources UP-TO-DATE
> :grails-datastore-gorm-plugin-support:classes UP-TO-DATE
> :grails-datastore-gorm-plugin-support:jar UP-TO-DATE
> :grails-datastore-gorm-dynamodb:compileJava UP-TO-DATE
> :grails-datastore-gorm-dynamodb:compileGroovy UP-TO-DATE
> :grails-datastore-gorm-dynamodb:processResources UP-TO-DATE
> :grails-datastore-gorm-dynamodb:classes UP-TO-DATE
> :grails-datastore-gorm-dynamodb:jar UP-TO-DATE
> :grails-datastore-web:javadoc UP-TO-DATE
> :grails-datastore-gorm-plugin-support:javadoc UP-TO-DATE
> :grails-datastore-gorm-dynamodb:javadoc UP-TO-DATE
> :grails-datastore-gorm-dynamodb:javadocJar UP-TO-DATE
> :grails-datastore-gorm-dynamodb:sourcesJar UP-TO-DATE
> :grails-datastore-gorm-dynamodb:signArchives SKIPPED
> :grails-datastore-gorm-dynamodb:assemble UP-TO-DATE
> :grails-datastore-gorm-tck:compileJava UP-TO-DATE
> :grails-datastore-gorm-tck:compileGroovy UP-TO-DATE
> :grails-datastore-gorm-tck:processResources UP-TO-DATE
> :grails-datastore-gorm-tck:classes UP-TO-DATE
> :grails-datastore-gorm-tck:jar UP-TO-DATE
> :grails-datastore-simple:compileJava UP-TO-DATE
> :grails-datastore-simple:compileGroovy UP-TO-DATE
> :grails-datastore-simple:processResources UP-TO-DATE
> :grails-datastore-simple:classes UP-TO-DATE
> :grails-datastore-simple:jar UP-TO-DATE
> :grails-datastore-gorm-test:compileJava UP-TO-DATE
> :grails-datastore-gorm-test:compileGroovy UP-TO-DATE
> :grails-datastore-gorm-test:processResources UP-TO-DATE
> :grails-datastore-gorm-test:classes UP-TO-DATE
> :grails-datastore-gorm-test:jar UP-TO-DATE
> :grails-datastore-gorm-dynamodb:compileTestJava UP-TO-DATE
> :grails-datastore-gorm-dynamodb:compileTestGroovy UP-TO-DATE
> :grails-datastore-gorm-dynamodb:processTestResources UP-TO-DATE
> :grails-datastore-gorm-dynamodb:testClasses UP-TO-DATE
> :grails-datastore-gorm-dynamodb:test
>
> grails.gorm.tests.DynamoDBHiloSpec > Test one FAILED
>     java.lang.IllegalArgumentException
>
> grails.gorm.tests.DynamoDBHiloSpec > Test multiple FAILED
>     java.lang.IllegalArgumentException
>
> grails.gorm.tests.QueryAfterPropertyChangeSpec > Test that an entity is de-indexed after a change to an indexed property FAILED
>     java.lang.IllegalArgumentException
>
> grails.gorm.tests.SessionPropertiesSpec > test session properties FAILED
>     java.lang.IllegalArgumentException
>
> grails.gorm.tests.GroovyProxySpec > Test proxying of non-existent instance throws an exception FAILED
>     java.lang.IllegalArgumentException
>
> grails.gorm.tests.GroovyProxySpec > Test creation and behavior of Groovy proxies FAILED
>     java.lang.IllegalArgumentException
>
> grails.gorm.tests.ValidationSpec > Test disable validation FAILED
>     java.lang.IllegalArgumentException
>
> grails.gorm.tests.ValidationSpec > Test validate() method FAILED
>     java.lang.IllegalArgumentException
>
> grails.gorm.tests.ValidationSpec > Test that validate is called on save() FAILED
>     java.lang.IllegalArgumentException
>
> grails.gorm.tests.ValidationSpec > Test beforeValidate gets called on save() FAILED
>     java.lang.IllegalArgumentException
>
> grails.gorm.tests.ValidationSpec > Test beforeValidate gets called on validate() FAILED
>     java.lang.IllegalArgumentException
>
> grails.gorm.tests.ValidationSpec > Test beforeValidate gets called on validate() and passing a list of field names to validate FAILED
>     java.lang.IllegalArgumentException
>
> grails.gorm.tests.ValidationSpec > Test that validate works without a bound Session FAILED
>     java.lang.IllegalArgumentException
>
> grails.gorm.tests.FindOrSaveWhereSpec > Test findOrSaveWhere returns a new instance if it doesn't exist in the database FAILED
>     java.lang.IllegalArgumentException
>
> grails.gorm.tests.FindOrSaveWhereSpec > Test findOrSaveWhere returns a persistent instance if it exists in the database FAILED
>     java.lang.IllegalArgumentException
>
> grails.gorm.tests.CriteriaBuilderSpec > Test idEq method FAILED
>     java.lang.IllegalArgumentException
>
> grails.gorm.tests.CriteriaBuilderSpec > Test disjunction query FAILED
>     java.lang.IllegalArgumentException
>
> grails.gorm.tests.CriteriaBuilderSpec > Test conjunction query FAILED
>     java.lang.IllegalArgumentException
>
> grails.gorm.tests.CriteriaBuilderSpec > Test list() query FAILED
>     java.lang.IllegalArgumentException
>
> grails.gorm.tests.CriteriaBuilderSpec > Test count() FAILED
>     java.lang.IllegalArgumentException
>
> grails.gorm.tests.CriteriaBuilderSpec > Test obtain a single result FAILED
>     java.lang.IllegalArgumentException
>
> grails.gorm.tests.CriteriaBuilderSpec > Test order by a property name FAILED
>     java.lang.IllegalArgumentException
>
> grails.gorm.tests.QueryByAssociationSpec > Test query entity by single-ended association FAILED
>     java.lang.IllegalArgumentException
>
> grails.gorm.tests.WithTransactionSpec > Test save() with transaction FAILED
>     java.lang.IllegalArgumentException
>
> grails.gorm.tests.WithTransactionSpec > Test rollback transaction FAILED
>     java.lang.IllegalArgumentException
>
> grails.gorm.tests.WithTransactionSpec > Test rollback transaction with Runtime Exception FAILED
>     java.lang.IllegalArgumentException
>
> grails.gorm.tests.WithTransactionSpec > Test rollback transaction with Exception FAILED
>     java.lang.IllegalArgumentException
>
> grails.gorm.tests.FindByExampleSpec > Test findAll by example FAILED
>     java.lang.IllegalArgumentException
>
> grails.gorm.tests.FindByExampleSpec > Test find by example FAILED
>     java.lang.IllegalArgumentException
>
> grails.gorm.tests.FindOrCreateWhereSpec > Test findOrCreateWhere returns a new instance if it doesn't exist in the database FAILED
>     java.lang.IllegalArgumentException
>
> grails.gorm.tests.FindOrCreateWhereSpec > Test findOrCreateWhere returns a persistent instance if it exists in the database FAILED
>     java.lang.IllegalArgumentException
>
> grails.gorm.tests.OneToManySpec > test save and return unidirectional one to many FAILED
>     java.lang.IllegalArgumentException
>
> grails.gorm.tests.OneToManySpec > test save and return bidirectional one to many FAILED
>     java.lang.IllegalArgumentException
>
> grails.gorm.tests.OneToManySpec > test update inverse side of bidirectional one to many collection FAILED
>     java.lang.IllegalArgumentException
>
> grails.gorm.tests.OneToManySpec > test update inverse side of bidirectional one to many happens before flushing the session FAILED
>     java.lang.IllegalArgumentException
>
> grails.gorm.tests.OneToManySpec > Test persist of association with proxy FAILED
>     java.lang.IllegalArgumentException
>
> grails.gorm.tests.CommonTypesPersistenceSpec > testPersistBasicTypes FAILED
>     java.lang.IllegalArgumentException
>
> grails.gorm.tests.OrderBySpec > Test order with criteria FAILED
>     java.lang.IllegalArgumentException
>
> grails.gorm.tests.OrderBySpec > Test order by with list() method FAILED
>     java.lang.IllegalArgumentException
>
> grails.gorm.tests.OrderBySpec > Test order by property name with dynamic finder FAILED
>     java.lang.IllegalArgumentException
>
> grails.gorm.tests.DomainEventsSpec > Test that returning false from beforeUpdate evicts the event FAILED
>     java.lang.IllegalArgumentException
>     java.lang.NullPointerException at DomainEventsSpec.groovy:295
>
> grails.gorm.tests.DomainEventsSpec > Test that returning false from beforeInsert evicts the event FAILED
>     java.lang.IllegalArgumentException
>     java.lang.NullPointerException at DomainEventsSpec.groovy:295
>
> grails.gorm.tests.DomainEventsSpec > Test that returning false from beforeDelete evicts the event FAILED
>     java.lang.IllegalArgumentException
>     java.lang.NullPointerException at DomainEventsSpec.groovy:295
>
> grails.gorm.tests.DomainEventsSpec > Test modify property before save FAILED
>     java.lang.IllegalArgumentException
>     java.lang.NullPointerException at DomainEventsSpec.groovy:295
>
> grails.gorm.tests.DomainEventsSpec > Test auto time stamping working FAILED
>     java.lang.IllegalArgumentException
>     java.lang.NullPointerException at DomainEventsSpec.groovy:295
>
> grails.gorm.tests.DomainEventsSpec > Test delete events FAILED
>     java.lang.IllegalArgumentException
>     java.lang.NullPointerException at DomainEventsSpec.groovy:295
>
> grails.gorm.tests.DomainEventsSpec > Test multi-delete events FAILED
>     java.lang.IllegalArgumentException
>     java.lang.NullPointerException at DomainEventsSpec.groovy:295
>
> grails.gorm.tests.DomainEventsSpec > Test before update event FAILED
>     java.lang.IllegalArgumentException
>     java.lang.NullPointerException at DomainEventsSpec.groovy:295
>
> grails.gorm.tests.DomainEventsSpec > Test insert events FAILED
>     java.lang.IllegalArgumentException
>     java.lang.NullPointerException at DomainEventsSpec.groovy:295
>
> grails.gorm.tests.DomainEventsSpec > Test load events FAILED
>     java.lang.IllegalArgumentException
>     java.lang.NullPointerException at DomainEventsSpec.groovy:295
>
> grails.gorm.tests.DomainEventsSpec > Test multi-load events FAILED
>     java.lang.IllegalArgumentException
>     java.lang.NullPointerException at DomainEventsSpec.groovy:295
>
> grails.gorm.tests.NegationSpec > Test negation in dynamic finder FAILED
>     java.lang.IllegalArgumentException
>
> grails.gorm.tests.NegationSpec > Test simple negation in criteria FAILED
>     java.lang.IllegalArgumentException
>
> grails.gorm.tests.NamedQuerySpec > Test named query with disjunction FAILED
>     java.lang.IllegalArgumentException
>
> grails.gorm.tests.NamedQuerySpec > Test max and offset parameter FAILED
>     java.lang.IllegalArgumentException
>
> grails.gorm.tests.NamedQuerySpec > Test that parameter to get is converted FAILED
>     java.lang.IllegalArgumentException
>
> grails.gorm.tests.NamedQuerySpec > Test named query with additional criteria closure FAILED
>     java.lang.IllegalArgumentException
>
> grails.gorm.tests.NamedQuerySpec > Test passing parameters to additional criteria FAILED
>     java.lang.IllegalArgumentException
>
> grails.gorm.tests.NamedQuerySpec > Test get method followed named query chaining FAILED
>     java.lang.IllegalArgumentException
>
> grails.gorm.tests.NamedQuerySpec > Test named query with findBy*() dynamic finder FAILED
>     java.lang.IllegalArgumentException
>
> grails.gorm.tests.NamedQuerySpec > Test named query with findAllBy*() dyamic finder FAILED
>     java.lang.IllegalArgumentException
>
> grails.gorm.tests.NamedQuerySpec > Test uniqueResult FAILED
>     java.lang.IllegalArgumentException
>
> grails.gorm.tests.NamedQuerySpec > Test findWhere method after chaining named queries FAILED
>     java.lang.IllegalArgumentException
>
> grails.gorm.tests.NamedQuerySpec > Test named query passing multiple parameters to a nested query FAILED
>     java.lang.IllegalArgumentException
>
> grails.gorm.tests.NamedQuerySpec > Test chaining named queries FAILED
>     java.lang.IllegalArgumentException
>
> grails.gorm.tests.NamedQuerySpec > Test referencing named query before any dynamic methods FAILED
>     java.lang.IllegalArgumentException
>
> grails.gorm.tests.NamedQuerySpec > Test named query with conjunction FAILED
>     java.lang.IllegalArgumentException
>
> grails.gorm.tests.NamedQuerySpec > Test named query with list() method FAILED
>     java.lang.IllegalArgumentException
>
> grails.gorm.tests.NamedQuerySpec > Test named query with countBy*() dynamic finder FAILED
>     java.lang.IllegalArgumentException
>
> grails.gorm.tests.NamedQuerySpec > Test get with id of object which does not match criteria FAILED
>     java.lang.IllegalArgumentException
>
> grails.gorm.tests.NamedQuerySpec > Test get method returns correct object FAILED
>     java.lang.IllegalArgumentException
>
> grails.gorm.tests.NamedQuerySpec > Test get method returns null FAILED
>     java.lang.IllegalArgumentException
>
> grails.gorm.tests.NamedQuerySpec > Test count method following named criteria FAILED
>     java.lang.IllegalArgumentException
>
> grails.gorm.tests.NamedQuerySpec > Test count with parameterized named query FAILED
>     java.lang.IllegalArgumentException
>
> grails.gorm.tests.NamedQuerySpec > Test max parameter FAILED
>     java.lang.IllegalArgumentException
>
> grails.gorm.tests.NamedQuerySpec > Test max results FAILED
>     java.lang.IllegalArgumentException
>
> grails.gorm.tests.NamedQuerySpec > Test findAllWhere method combined with named query FAILED
>     java.lang.IllegalArgumentException
>
> grails.gorm.tests.NamedQuerySpec > Test findAllWhere method with named query and disjunction FAILED
>     java.lang.IllegalArgumentException
>
> grails.gorm.tests.NamedQuerySpec > Test get with parameterized named query FAILED
>     java.lang.IllegalArgumentException
>
> grails.gorm.tests.NamedQuerySpec > Test named query with one parameter FAILED
>     java.lang.IllegalArgumentException
>
> grails.gorm.tests.NamedQuerySpec > Test named query with multiple parameters FAILED
>     java.lang.IllegalArgumentException
>
> grails.gorm.tests.NamedQuerySpec > Test named query with multiple parameters and dynamic finder FAILED
>     java.lang.IllegalArgumentException
>
> grails.gorm.tests.NamedQuerySpec > Test named query with multiple parameters and map FAILED
>     java.lang.IllegalArgumentException
>
> grails.gorm.tests.NamedQuerySpec > Test findWhere with named query FAILED
>     java.lang.IllegalArgumentException
>
> grails.gorm.tests.LexComparisonSpec > Test byte comparison FAILED
>     java.lang.IllegalArgumentException
>
> grails.gorm.tests.LexComparisonSpec > Test short comparison FAILED
>     java.lang.IllegalArgumentException
>
> grails.gorm.tests.LexComparisonSpec > Test integer comparison FAILED
>     java.lang.IllegalArgumentException
>
> grails.gorm.tests.LexComparisonSpec > Test long comparison FAILED
>     java.lang.IllegalArgumentException
>
> grails.gorm.tests.DisableAutotimeStampSpec > Test that when auto timestamping is disabled the dateCreated and lastUpdated properties are not set FAILED
>     java.lang.IllegalArgumentException
>
> grails.gorm.tests.OneToOneSpec > Test persist and retrieve unidirectional many-to-one FAILED
>     java.lang.IllegalArgumentException
>
> grails.gorm.tests.OneToOneSpec > Test persist and retrieve one-to-one with inverse key FAILED
>     java.lang.IllegalArgumentException
>
> grails.gorm.tests.PersistenceEventListenerSpec > Test delete events FAILED
>     java.lang.IllegalArgumentException
>
> grails.gorm.tests.PersistenceEventListenerSpec > Test multi-delete events FAILED
>     java.lang.IllegalArgumentException
>
> grails.gorm.tests.PersistenceEventListenerSpec > Test update events FAILED
>     java.lang.IllegalArgumentException
>
> grails.gorm.tests.PersistenceEventListenerSpec > Test insert events FAILED
>     java.lang.IllegalArgumentException
>
> grails.gorm.tests.PersistenceEventListenerSpec > Test load events FAILED
>     java.lang.IllegalArgumentException
>
> grails.gorm.tests.PersistenceEventListenerSpec > Test multi-load events FAILED
>     java.lang.IllegalArgumentException
>
> grails.gorm.tests.PersistenceEventListenerSpec > Test validation events FAILED
>     java.lang.IllegalArgumentException
>
> grails.gorm.tests.UniqueConstraintSpec > Test simple unique constraint FAILED
>     java.lang.IllegalArgumentException
>
> grails.gorm.tests.UniqueConstraintSpec > should update to a existing value fail FAILED
>     java.lang.IllegalArgumentException
>
> grails.gorm.tests.UniqueConstraintSpec > withManualFlushMode should use flushmode commit FAILED
>     java.lang.IllegalArgumentException
>
> grails.gorm.tests.GormEnhancerSpec > Test basic CRUD operations FAILED
>     java.lang.IllegalArgumentException
>
> grails.gorm.tests.GormEnhancerSpec > Test simple dynamic finder FAILED
>     java.lang.IllegalArgumentException
>
> grails.gorm.tests.GormEnhancerSpec > Test dynamic finder with disjunction FAILED
>     java.lang.IllegalArgumentException
>
> grails.gorm.tests.GormEnhancerSpec > Test getAll() method FAILED
>     java.lang.IllegalArgumentException
>
> grails.gorm.tests.GormEnhancerSpec > Test ident() method FAILED
>     java.lang.IllegalArgumentException
>
> grails.gorm.tests.GormEnhancerSpec > Test dynamic finder with pagination parameters FAILED
>     java.lang.IllegalArgumentException
>
> grails.gorm.tests.GormEnhancerSpec > Test in list query FAILED
>     java.lang.IllegalArgumentException
>
> grails.gorm.tests.GormEnhancerSpec > Test like query FAILED
>     java.lang.IllegalArgumentException
>
> grails.gorm.tests.GormEnhancerSpec > Test count by query FAILED
>     java.lang.IllegalArgumentException
>
> grails.gorm.tests.GormEnhancerSpec > Test dynamic finder with conjunction FAILED
>     java.lang.IllegalArgumentException
>
> grails.gorm.tests.GormEnhancerSpec > Test count() method FAILED
>     java.lang.IllegalArgumentException
>
> grails.gorm.tests.InheritanceSpec > Test inheritance with dynamic finder FAILED
>     java.lang.IllegalArgumentException
>
> grails.gorm.tests.QueryByNullSpec > Test passing null as the sole argument to a dynamic finder multiple times FAILED
>     java.lang.IllegalArgumentException
>
> grails.gorm.tests.RangeQuerySpec > Test between query with dates FAILED
>     java.lang.IllegalArgumentException
>
> grails.gorm.tests.RangeQuerySpec > Test between query FAILED
>     java.lang.IllegalArgumentException
>
> grails.gorm.tests.RangeQuerySpec > Test greater than or equal to and less than or equal to queries FAILED
>     java.lang.IllegalArgumentException
>
> grails.gorm.tests.RangeQuerySpec > Test InRange Dynamic Finder FAILED
>     java.lang.IllegalArgumentException
>
> grails.gorm.tests.AttachMethodSpec > Test attach method FAILED
>     java.lang.IllegalArgumentException
>
> grails.gorm.tests.DeleteAllSpec > Test that many objects can be deleted at once using multiple arguments FAILED
>     java.lang.IllegalArgumentException
>
> grails.gorm.tests.DeleteAllSpec > Test that many objects can be deleted using an iterable FAILED
>     java.lang.IllegalArgumentException
>
> grails.gorm.tests.CrudOperationsSpec > Test get using a string-based key FAILED
>     java.lang.IllegalArgumentException
>
> grails.gorm.tests.CrudOperationsSpec > Test get returns null of non-existent entity FAILED
>     java.lang.IllegalArgumentException
>
> grails.gorm.tests.CrudOperationsSpec > Test basic CRUD operations FAILED
>     java.lang.IllegalArgumentException
>
> grails.gorm.tests.CrudOperationsSpec > Test save method that takes a map FAILED
>     java.lang.IllegalArgumentException
>
> grails.gorm.tests.CrudOperationsSpec > Test failOnError FAILED
>     java.lang.IllegalArgumentException
>
> grails.gorm.tests.UpdateWithProxyPresentSpec > Test update entity with association proxies FAILED
>     java.lang.IllegalArgumentException
>
> grails.gorm.tests.UpdateWithProxyPresentSpec > Test update unidirectional oneToMany with proxy FAILED
>     java.lang.IllegalArgumentException
>
> grails.gorm.tests.CircularOneToManySpec > Test circular one-to-many FAILED
>     java.lang.IllegalArgumentException
>
> grails.gorm.tests.MultilineValueSpec > Test multivalue with slash n FAILED
>     java.lang.IllegalArgumentException
>
> grails.gorm.tests.MultilineValueSpec > Test multivalue with slash r slash n FAILED
>     java.lang.IllegalArgumentException
>
> grails.gorm.tests.EnumSpec > Test save() FAILED
>     java.lang.IllegalArgumentException
>
> grails.gorm.tests.EnumSpec > Test findByInList() FAILED
>     java.lang.IllegalArgumentException
>
> grails.gorm.tests.EnumSpec > Test findBy() FAILED
>     java.lang.IllegalArgumentException
>
> grails.gorm.tests.EnumSpec > Test findBy() with clearing the session FAILED
>     java.lang.IllegalArgumentException
>
> grails.gorm.tests.EnumSpec > Test findAllBy() FAILED
>     java.lang.IllegalArgumentException
>
> grails.gorm.tests.EnumSpec > Test countBy() FAILED
>     java.lang.IllegalArgumentException
>
> grails.gorm.tests.OptimisticLockingSpec > Test versioning FAILED
>     java.lang.IllegalArgumentException
>
> grails.gorm.tests.OptimisticLockingSpec > Test optimistic locking FAILED
>     java.lang.IllegalArgumentException
>
> grails.gorm.tests.OptimisticLockingSpec > Test optimistic locking disabled with 'version false' FAILED
>     java.lang.IllegalArgumentException
>
> grails.gorm.tests.ListOrderBySpec > Test listOrderBy property name method FAILED
>     java.lang.IllegalArgumentException
>
> grails.gorm.tests.ConstraintsSpec > Test constraints with static default values FAILED
>     java.lang.IllegalArgumentException
>
> grails.gorm.tests.FindByMethodSpec > Test Using AND Multiple Times In A Dynamic Finder FAILED
>     java.lang.IllegalArgumentException
>
> grails.gorm.tests.FindByMethodSpec > Test Using OR Multiple Times In A Dynamic Finder FAILED
>     java.lang.IllegalArgumentException
>
> grails.gorm.tests.FindByMethodSpec > testBooleanPropertyQuery FAILED
>     java.lang.IllegalArgumentException
>
> grails.gorm.tests.FindByMethodSpec > Test findOrCreateBy For A Record That Does Not Exist In The Database FAILED
>     java.lang.IllegalArgumentException
>
> grails.gorm.tests.FindByMethodSpec > Test findOrCreateBy With An AND Clause FAILED
>     java.lang.IllegalArgumentException
>
> grails.gorm.tests.FindByMethodSpec > Test findOrCreateBy Throws Exception If An OR Clause Is Used FAILED
>     java.lang.IllegalArgumentException
>
> grails.gorm.tests.FindByMethodSpec > Test findOrSaveBy For A Record That Does Not Exist In The Database FAILED
>     java.lang.IllegalArgumentException
>
> grails.gorm.tests.FindByMethodSpec > Test findOrSaveBy For A Record That Does Exist In The Database FAILED
>     java.lang.IllegalArgumentException
>
> grails.gorm.tests.FindByMethodSpec > Test patterns which shold throw MissingMethodException FAILED
>     java.lang.IllegalArgumentException
>
> grails.gorm.tests.ProxyLoadingSpec > Test load proxied instance directly FAILED
>     java.lang.IllegalArgumentException
>
> grails.gorm.tests.ProxyLoadingSpec > Test query using proxied association FAILED
>     java.lang.IllegalArgumentException
>
> grails.gorm.tests.SaveAllSpec > Test that many objects can be saved at once using multiple arguments FAILED
>     java.lang.IllegalArgumentException
>
> grails.gorm.tests.SaveAllSpec > Test that many objects can be saved at once using a list FAILED
>     java.lang.IllegalArgumentException
>
> grails.gorm.tests.SaveAllSpec > Test that many objects can be saved at once using an iterable FAILED
>     java.lang.IllegalArgumentException
>
> 169 tests completed, 156 failed, 9 skipped
> :grails-datastore-gorm-dynamodb:test FAILED
>
> FAILURE: Build failed with an exception.
>
> * What went wrong:
> Execution failed for task ':grails-datastore-gorm-dynamodb:test'.
> > There were failing tests. See the report at: file:///home/john/builds/grails/grails-data-mapping/grails-datastore-gorm-dynamodb/build/reports/tests/index.html
>
> * Try:
> Run with --stacktrace option to get the stack trace. Run with --info or --debug option to get more log output.
>
> BUILD FAILED
>
> Total time: 15.001 secs
>
>
> --
> You received this message because you are subscribed to the Google Groups "Grails Dev Discuss" group.
> To unsubscribe from this group and stop receiving emails from it, send an email to [hidden email].
> To post to this group, send email to [hidden email].
> To view this discussion on the web visit https://groups.google.com/d/msgid/grails-dev-discuss/f0541063-d856-49bd-9e13-c8d3049d82fc%40googlegroups.com.
> For more options, visit https://groups.google.com/d/optout.


Jeff Scott Brown
Principal Software Engineer
Grails Development Team
Object Computing Inc.
http://www.ociweb.com/

Autism Strikes 1 in 166
Find The Cause ~ Find The Cure
http://www.autismspeaks.org/

--
You received this message because you are subscribed to the Google Groups "Grails Dev Discuss" group.
To unsubscribe from this group and stop receiving emails from it, send an email to [hidden email].
To post to this group, send email to [hidden email].
To view this discussion on the web visit https://groups.google.com/d/msgid/grails-dev-discuss/A5EB9129-AE09-4C2D-B8BD-A988AEB71D4C%40ociweb.com.
For more options, visit https://groups.google.com/d/optout.
Reply | Threaded
Open this post in threaded view
|  
Report Content as Inappropriate

Re: gradle build of grails-data-mapping 2.5.x fails tests

John Pandich
Thank you so much Jeff! I did not know you could do that with Gradle. You are a hero!

On Thursday, March 10, 2016 at 1:10:43 PM UTC-5, Jeff Scott Brown wrote:
Unless you are working on dynamo stuff in particular, you probably want to exclude the dynamo tests from your local build with something like “-x :grails-datastore-gorm-dynamodb:test”



JSB

> On Mar 10, 2016, at 12:07 PM, John Pandich <<a href="javascript:" target="_blank" gdf-obfuscated-mailto="jFyNlo-jCQAJ" rel="nofollow" onmousedown="this.href=&#39;javascript:&#39;;return true;" onclick="this.href=&#39;javascript:&#39;;return true;">jrpa...@...> wrote:
>
> Hello,
>
> I am attempting to back fit <a href="https://github.com/grails/grails-data-mapping/commit/7415062050ea1a21a9c0650d2a22d6f1608af4fe" target="_blank" rel="nofollow" onmousedown="this.href=&#39;https://www.google.com/url?q\75https%3A%2F%2Fgithub.com%2Fgrails%2Fgrails-data-mapping%2Fcommit%2F7415062050ea1a21a9c0650d2a22d6f1608af4fe\46sa\75D\46sntz\0751\46usg\75AFQjCNGi2wKhykcUBxQ41RMbOC8VzCWC3w&#39;;return true;" onclick="this.href=&#39;https://www.google.com/url?q\75https%3A%2F%2Fgithub.com%2Fgrails%2Fgrails-data-mapping%2Fcommit%2F7415062050ea1a21a9c0650d2a22d6f1608af4fe\46sa\75D\46sntz\0751\46usg\75AFQjCNGi2wKhykcUBxQ41RMbOC8VzCWC3w&#39;;return true;">https://github.com/grails/grails-data-mapping/commit/7415062050ea1a21a9c0650d2a22d6f1608af4fe to Grails 2.5 but I have run into a problem building (even without my changes in a vanilla 2.5 build). Any input would be greatly appreciated.
> Here is what I am seeing:
>
> The groovy configuration has been deprecated and is scheduled to be removed in Gradle 2.0. Typically, usages of 'groovy' can simply be replaced with 'compile'. In some cases, it may be necessary to additionally configure the 'groovyClasspath' property of GroovyCompile and Groovydoc tasks.
> :grails-datastore-core:compileJava UP-TO-DATE
> :grails-datastore-core:compileGroovy UP-TO-DATE
> :grails-datastore-core:processResources UP-TO-DATE
> :grails-datastore-core:classes UP-TO-DATE
> :grails-datastore-core:jar UP-TO-DATE
> :grails-datastore-core:javadoc UP-TO-DATE
> :grails-datastore-core:javadocJar UP-TO-DATE
> :grails-datastore-core:sourcesJar UP-TO-DATE
> :grails-datastore-core:signArchives SKIPPED
> :grails-datastore-core:assemble UP-TO-DATE
> :grails-datastore-core:compileTestJava UP-TO-DATE
> :grails-datastore-core:compileTestGroovy UP-TO-DATE
> :grails-datastore-core:processTestResources UP-TO-DATE
> :grails-datastore-core:testClasses UP-TO-DATE
> :grails-datastore-core:test UP-TO-DATE
> :grails-datastore-core:check UP-TO-DATE
> :grails-datastore-core:build UP-TO-DATE
> :grails-datastore-dynamodb:compileJava UP-TO-DATE
> :grails-datastore-dynamodb:compileGroovy UP-TO-DATE
> :grails-datastore-dynamodb:processResources UP-TO-DATE
> :grails-datastore-dynamodb:classes UP-TO-DATE
> :grails-datastore-dynamodb:jar UP-TO-DATE
> :grails-datastore-dynamodb:javadoc UP-TO-DATE
> :grails-datastore-dynamodb:javadocJar UP-TO-DATE
> :grails-datastore-dynamodb:sourcesJar UP-TO-DATE
> :grails-datastore-dynamodb:signArchives SKIPPED
> :grails-datastore-dynamodb:assemble UP-TO-DATE
> :grails-datastore-dynamodb:compileTestJava UP-TO-DATE
> :grails-datastore-dynamodb:compileTestGroovy UP-TO-DATE
> :grails-datastore-dynamodb:processTestResources UP-TO-DATE
> :grails-datastore-dynamodb:testClasses UP-TO-DATE
> :grails-datastore-dynamodb:test UP-TO-DATE
> :grails-datastore-dynamodb:check UP-TO-DATE
> :grails-datastore-dynamodb:build UP-TO-DATE
> :grails-datastore-gemfire:compileJava UP-TO-DATE
> :grails-datastore-gemfire:compileGroovy UP-TO-DATE
> :grails-datastore-gemfire:processResources UP-TO-DATE
> :grails-datastore-gemfire:classes UP-TO-DATE
> :grails-datastore-gemfire:jar UP-TO-DATE
> :grails-datastore-gemfire:javadoc UP-TO-DATE
> :grails-datastore-gemfire:javadocJar UP-TO-DATE
> :grails-datastore-gemfire:sourcesJar UP-TO-DATE
> :grails-datastore-gemfire:signArchives SKIPPED
> :grails-datastore-gemfire:assemble UP-TO-DATE
> :grails-datastore-gemfire:compileTestJava UP-TO-DATE
> :grails-datastore-gemfire:compileTestGroovy UP-TO-DATE
> :grails-datastore-gemfire:processTestResources UP-TO-DATE
> :grails-datastore-gemfire:testClasses UP-TO-DATE
> :grails-datastore-gemfire:test UP-TO-DATE
> :grails-datastore-gemfire:check UP-TO-DATE
> :grails-datastore-gemfire:build UP-TO-DATE
> :grails-datastore-gorm:compileJava UP-TO-DATE
> :grails-datastore-gorm:compileGroovy UP-TO-DATE
> :grails-datastore-gorm:processResources UP-TO-DATE
> :grails-datastore-gorm:classes UP-TO-DATE
> :grails-datastore-gorm:jar UP-TO-DATE
> :grails-datastore-gorm:javadoc UP-TO-DATE
> :grails-datastore-gorm:javadocJar UP-TO-DATE
> :grails-datastore-gorm:sourcesJar UP-TO-DATE
> :grails-datastore-gorm:signArchives SKIPPED
> :grails-datastore-gorm:assemble UP-TO-DATE
> :grails-datastore-gorm:compileTestJava UP-TO-DATE
> :grails-datastore-gorm:compileTestGroovy UP-TO-DATE
> :grails-datastore-gorm:processTestResources UP-TO-DATE
> :grails-datastore-gorm:testClasses UP-TO-DATE
> :grails-datastore-gorm:test UP-TO-DATE
> :grails-datastore-gorm:check UP-TO-DATE
> :grails-datastore-gorm:build UP-TO-DATE
> :grails-datastore-web:compileJava UP-TO-DATE
> :grails-datastore-web:compileGroovy UP-TO-DATE
> :grails-datastore-web:processResources UP-TO-DATE
> :grails-datastore-web:classes UP-TO-DATE
> :grails-datastore-web:jar UP-TO-DATE
> :grails-datastore-gorm-plugin-support:compileJava UP-TO-DATE
> :grails-datastore-gorm-plugin-support:compileGroovy UP-TO-DATE
> :grails-datastore-gorm-plugin-support:processResources UP-TO-DATE
> :grails-datastore-gorm-plugin-support:classes UP-TO-DATE
> :grails-datastore-gorm-plugin-support:jar UP-TO-DATE
> :grails-datastore-gorm-dynamodb:compileJava UP-TO-DATE
> :grails-datastore-gorm-dynamodb:compileGroovy UP-TO-DATE
> :grails-datastore-gorm-dynamodb:processResources UP-TO-DATE
> :grails-datastore-gorm-dynamodb:classes UP-TO-DATE
> :grails-datastore-gorm-dynamodb:jar UP-TO-DATE
> :grails-datastore-web:javadoc UP-TO-DATE
> :grails-datastore-gorm-plugin-support:javadoc UP-TO-DATE
> :grails-datastore-gorm-dynamodb:javadoc UP-TO-DATE
> :grails-datastore-gorm-dynamodb:javadocJar UP-TO-DATE
> :grails-datastore-gorm-dynamodb:sourcesJar UP-TO-DATE
> :grails-datastore-gorm-dynamodb:signArchives SKIPPED
> :grails-datastore-gorm-dynamodb:assemble UP-TO-DATE
> :grails-datastore-gorm-tck:compileJava UP-TO-DATE
> :grails-datastore-gorm-tck:compileGroovy UP-TO-DATE
> :grails-datastore-gorm-tck:processResources UP-TO-DATE
> :grails-datastore-gorm-tck:classes UP-TO-DATE
> :grails-datastore-gorm-tck:jar UP-TO-DATE
> :grails-datastore-simple:compileJava UP-TO-DATE
> :grails-datastore-simple:compileGroovy UP-TO-DATE
> :grails-datastore-simple:processResources UP-TO-DATE
> :grails-datastore-simple:classes UP-TO-DATE
> :grails-datastore-simple:jar UP-TO-DATE
> :grails-datastore-gorm-test:compileJava UP-TO-DATE
> :grails-datastore-gorm-test:compileGroovy UP-TO-DATE
> :grails-datastore-gorm-test:processResources UP-TO-DATE
> :grails-datastore-gorm-test:classes UP-TO-DATE
> :grails-datastore-gorm-test:jar UP-TO-DATE
> :grails-datastore-gorm-dynamodb:compileTestJava UP-TO-DATE
> :grails-datastore-gorm-dynamodb:compileTestGroovy UP-TO-DATE
> :grails-datastore-gorm-dynamodb:processTestResources UP-TO-DATE
> :grails-datastore-gorm-dynamodb:testClasses UP-TO-DATE
> :grails-datastore-gorm-dynamodb:test
>
> grails.gorm.tests.DynamoDBHiloSpec > Test one FAILED
>     java.lang.IllegalArgumentException
>
> grails.gorm.tests.DynamoDBHiloSpec > Test multiple FAILED
>     java.lang.IllegalArgumentException
>
> grails.gorm.tests.QueryAfterPropertyChangeSpec > Test that an entity is de-indexed after a change to an indexed property FAILED
>     java.lang.IllegalArgumentException
>
> grails.gorm.tests.SessionPropertiesSpec > test session properties FAILED
>     java.lang.IllegalArgumentException
>
> grails.gorm.tests.GroovyProxySpec > Test proxying of non-existent instance throws an exception FAILED
>     java.lang.IllegalArgumentException
>
> grails.gorm.tests.GroovyProxySpec > Test creation and behavior of Groovy proxies FAILED
>     java.lang.IllegalArgumentException
>
> grails.gorm.tests.ValidationSpec > Test disable validation FAILED
>     java.lang.IllegalArgumentException
>
> grails.gorm.tests.ValidationSpec > Test validate() method FAILED
>     java.lang.IllegalArgumentException
>
> grails.gorm.tests.ValidationSpec > Test that validate is called on save() FAILED
>     java.lang.IllegalArgumentException
>
> grails.gorm.tests.ValidationSpec > Test beforeValidate gets called on save() FAILED
>     java.lang.IllegalArgumentException
>
> grails.gorm.tests.ValidationSpec > Test beforeValidate gets called on validate() FAILED
>     java.lang.IllegalArgumentException
>
> grails.gorm.tests.ValidationSpec > Test beforeValidate gets called on validate() and passing a list of field names to validate FAILED
>     java.lang.IllegalArgumentException
>
> grails.gorm.tests.ValidationSpec > Test that validate works without a bound Session FAILED
>     java.lang.IllegalArgumentException
>
> grails.gorm.tests.FindOrSaveWhereSpec > Test findOrSaveWhere returns a new instance if it doesn't exist in the database FAILED
>     java.lang.IllegalArgumentException
>
> grails.gorm.tests.FindOrSaveWhereSpec > Test findOrSaveWhere returns a persistent instance if it exists in the database FAILED
>     java.lang.IllegalArgumentException
>
> grails.gorm.tests.CriteriaBuilderSpec > Test idEq method FAILED
>     java.lang.IllegalArgumentException
>
> grails.gorm.tests.CriteriaBuilderSpec > Test disjunction query FAILED
>     java.lang.IllegalArgumentException
>
> grails.gorm.tests.CriteriaBuilderSpec > Test conjunction query FAILED
>     java.lang.IllegalArgumentException
>
> grails.gorm.tests.CriteriaBuilderSpec > Test list() query FAILED
>     java.lang.IllegalArgumentException
>
> grails.gorm.tests.CriteriaBuilderSpec > Test count() FAILED
>     java.lang.IllegalArgumentException
>
> grails.gorm.tests.CriteriaBuilderSpec > Test obtain a single result FAILED
>     java.lang.IllegalArgumentException
>
> grails.gorm.tests.CriteriaBuilderSpec > Test order by a property name FAILED
>     java.lang.IllegalArgumentException
>
> grails.gorm.tests.QueryByAssociationSpec > Test query entity by single-ended association FAILED
>     java.lang.IllegalArgumentException
>
> grails.gorm.tests.WithTransactionSpec > Test save() with transaction FAILED
>     java.lang.IllegalArgumentException
>
> grails.gorm.tests.WithTransactionSpec > Test rollback transaction FAILED
>     java.lang.IllegalArgumentException
>
> grails.gorm.tests.WithTransactionSpec > Test rollback transaction with Runtime Exception FAILED
>     java.lang.IllegalArgumentException
>
> grails.gorm.tests.WithTransactionSpec > Test rollback transaction with Exception FAILED
>     java.lang.IllegalArgumentException
>
> grails.gorm.tests.FindByExampleSpec > Test findAll by example FAILED
>     java.lang.IllegalArgumentException
>
> grails.gorm.tests.FindByExampleSpec > Test find by example FAILED
>     java.lang.IllegalArgumentException
>
> grails.gorm.tests.FindOrCreateWhereSpec > Test findOrCreateWhere returns a new instance if it doesn't exist in the database FAILED
>     java.lang.IllegalArgumentException
>
> grails.gorm.tests.FindOrCreateWhereSpec > Test findOrCreateWhere returns a persistent instance if it exists in the database FAILED
>     java.lang.IllegalArgumentException
>
> grails.gorm.tests.OneToManySpec > test save and return unidirectional one to many FAILED
>     java.lang.IllegalArgumentException
>
> grails.gorm.tests.OneToManySpec > test save and return bidirectional one to many FAILED
>     java.lang.IllegalArgumentException
>
> grails.gorm.tests.OneToManySpec > test update inverse side of bidirectional one to many collection FAILED
>     java.lang.IllegalArgumentException
>
> grails.gorm.tests.OneToManySpec > test update inverse side of bidirectional one to many happens before flushing the session FAILED
>     java.lang.IllegalArgumentException
>
> grails.gorm.tests.OneToManySpec > Test persist of association with proxy FAILED
>     java.lang.IllegalArgumentException
>
> grails.gorm.tests.CommonTypesPersistenceSpec > testPersistBasicTypes FAILED
>     java.lang.IllegalArgumentException
>
> grails.gorm.tests.OrderBySpec > Test order with criteria FAILED
>     java.lang.IllegalArgumentException
>
> grails.gorm.tests.OrderBySpec > Test order by with list() method FAILED
>     java.lang.IllegalArgumentException
>
> grails.gorm.tests.OrderBySpec > Test order by property name with dynamic finder FAILED
>     java.lang.IllegalArgumentException
>
> grails.gorm.tests.DomainEventsSpec > Test that returning false from beforeUpdate evicts the event FAILED
>     java.lang.IllegalArgumentException
>     java.lang.NullPointerException at DomainEventsSpec.groovy:295
>
> grails.gorm.tests.DomainEventsSpec > Test that returning false from beforeInsert evicts the event FAILED
>     java.lang.IllegalArgumentException
>     java.lang.NullPointerException at DomainEventsSpec.groovy:295
>
> grails.gorm.tests.DomainEventsSpec > Test that returning false from beforeDelete evicts the event FAILED
>     java.lang.IllegalArgumentException
>     java.lang.NullPointerException at DomainEventsSpec.groovy:295
>
> grails.gorm.tests.DomainEventsSpec > Test modify property before save FAILED
>     java.lang.IllegalArgumentException
>     java.lang.NullPointerException at DomainEventsSpec.groovy:295
>
> grails.gorm.tests.DomainEventsSpec > Test auto time stamping working FAILED
>     java.lang.IllegalArgumentException
>     java.lang.NullPointerException at DomainEventsSpec.groovy:295
>
> grails.gorm.tests.DomainEventsSpec > Test delete events FAILED
>     java.lang.IllegalArgumentException
>     java.lang.NullPointerException at DomainEventsSpec.groovy:295
>
> grails.gorm.tests.DomainEventsSpec > Test multi-delete events FAILED
>     java.lang.IllegalArgumentException
>     java.lang.NullPointerException at DomainEventsSpec.groovy:295
>
> grails.gorm.tests.DomainEventsSpec > Test before update event FAILED
>     java.lang.IllegalArgumentException
>     java.lang.NullPointerException at DomainEventsSpec.groovy:295
>
> grails.gorm.tests.DomainEventsSpec > Test insert events FAILED
>     java.lang.IllegalArgumentException
>     java.lang.NullPointerException at DomainEventsSpec.groovy:295
>
> grails.gorm.tests.DomainEventsSpec > Test load events FAILED
>     java.lang.IllegalArgumentException
>     java.lang.NullPointerException at DomainEventsSpec.groovy:295
>
> grails.gorm.tests.DomainEventsSpec > Test multi-load events FAILED
>     java.lang.IllegalArgumentException
>     java.lang.NullPointerException at DomainEventsSpec.groovy:295
>
> grails.gorm.tests.NegationSpec > Test negation in dynamic finder FAILED
>     java.lang.IllegalArgumentException
>
> grails.gorm.tests.NegationSpec > Test simple negation in criteria FAILED
>     java.lang.IllegalArgumentException
>
> grails.gorm.tests.NamedQuerySpec > Test named query with disjunction FAILED
>     java.lang.IllegalArgumentException
>
> grails.gorm.tests.NamedQuerySpec > Test max and offset parameter FAILED
>     java.lang.IllegalArgumentException
>
> grails.gorm.tests.NamedQuerySpec > Test that parameter to get is converted FAILED
>     java.lang.IllegalArgumentException
>
> grails.gorm.tests.NamedQuerySpec > Test named query with additional criteria closure FAILED
>     java.lang.IllegalArgumentException
>
> grails.gorm.tests.NamedQuerySpec > Test passing parameters to additional criteria FAILED
>     java.lang.IllegalArgumentException
>
> grails.gorm.tests.NamedQuerySpec > Test get method followed named query chaining FAILED
>     java.lang.IllegalArgumentException
>
> grails.gorm.tests.NamedQuerySpec > Test named query with findBy*() dynamic finder FAILED
>     java.lang.IllegalArgumentException
>
> grails.gorm.tests.NamedQuerySpec > Test named query with findAllBy*() dyamic finder FAILED
>     java.lang.IllegalArgumentException
>
> grails.gorm.tests.NamedQuerySpec > Test uniqueResult FAILED
>     java.lang.IllegalArgumentException
>
> grails.gorm.tests.NamedQuerySpec > Test findWhere method after chaining named queries FAILED
>     java.lang.IllegalArgumentException
>
> grails.gorm.tests.NamedQuerySpec > Test named query passing multiple parameters to a nested query FAILED
>     java.lang.IllegalArgumentException
>
> grails.gorm.tests.NamedQuerySpec > Test chaining named queries FAILED
>     java.lang.IllegalArgumentException
>
> grails.gorm.tests.NamedQuerySpec > Test referencing named query before any dynamic methods FAILED
>     java.lang.IllegalArgumentException
>
> grails.gorm.tests.NamedQuerySpec > Test named query with conjunction FAILED
>     java.lang.IllegalArgumentException
>
> grails.gorm.tests.NamedQuerySpec > Test named query with list() method FAILED
>     java.lang.IllegalArgumentException
>
> grails.gorm.tests.NamedQuerySpec > Test named query with countBy*() dynamic finder FAILED
>     java.lang.IllegalArgumentException
>
> grails.gorm.tests.NamedQuerySpec > Test get with id of object which does not match criteria FAILED
>     java.lang.IllegalArgumentException
>
> grails.gorm.tests.NamedQuerySpec > Test get method returns correct object FAILED
>     java.lang.IllegalArgumentException
>
> grails.gorm.tests.NamedQuerySpec > Test get method returns null FAILED
>     java.lang.IllegalArgumentException
>
> grails.gorm.tests.NamedQuerySpec > Test count method following named criteria FAILED
>     java.lang.IllegalArgumentException
>
> grails.gorm.tests.NamedQuerySpec > Test count with parameterized named query FAILED
>     java.lang.IllegalArgumentException
>
> grails.gorm.tests.NamedQuerySpec > Test max parameter FAILED
>     java.lang.IllegalArgumentException
>
> grails.gorm.tests.NamedQuerySpec > Test max results FAILED
>     java.lang.IllegalArgumentException
>
> grails.gorm.tests.NamedQuerySpec > Test findAllWhere method combined with named query FAILED
>     java.lang.IllegalArgumentException
>
> grails.gorm.tests.NamedQuerySpec > Test findAllWhere method with named query and disjunction FAILED
>     java.lang.IllegalArgumentException
>
> grails.gorm.tests.NamedQuerySpec > Test get with parameterized named query FAILED
>     java.lang.IllegalArgumentException
>
> grails.gorm.tests.NamedQuerySpec > Test named query with one parameter FAILED
>     java.lang.IllegalArgumentException
>
> grails.gorm.tests.NamedQuerySpec > Test named query with multiple parameters FAILED
>     java.lang.IllegalArgumentException
>
> grails.gorm.tests.NamedQuerySpec > Test named query with multiple parameters and dynamic finder FAILED
>     java.lang.IllegalArgumentException
>
> grails.gorm.tests.NamedQuerySpec > Test named query with multiple parameters and map FAILED
>     java.lang.IllegalArgumentException
>
> grails.gorm.tests.NamedQuerySpec > Test findWhere with named query FAILED
>     java.lang.IllegalArgumentException
>
> grails.gorm.tests.LexComparisonSpec > Test byte comparison FAILED
>     java.lang.IllegalArgumentException
>
> grails.gorm.tests.LexComparisonSpec > Test short comparison FAILED
>     java.lang.IllegalArgumentException
>
> grails.gorm.tests.LexComparisonSpec > Test integer comparison FAILED
>     java.lang.IllegalArgumentException
>
> grails.gorm.tests.LexComparisonSpec > Test long comparison FAILED
>     java.lang.IllegalArgumentException
>
> grails.gorm.tests.DisableAutotimeStampSpec > Test that when auto timestamping is disabled the dateCreated and lastUpdated properties are not set FAILED
>     java.lang.IllegalArgumentException
>
> grails.gorm.tests.OneToOneSpec > Test persist and retrieve unidirectional many-to-one FAILED
>     java.lang.IllegalArgumentException
>
> grails.gorm.tests.OneToOneSpec > Test persist and retrieve one-to-one with inverse key FAILED
>     java.lang.IllegalArgumentException
>
> grails.gorm.tests.PersistenceEventListenerSpec > Test delete events FAILED
>     java.lang.IllegalArgumentException
>
> grails.gorm.tests.PersistenceEventListenerSpec > Test multi-delete events FAILED
>     java.lang.IllegalArgumentException
>
> grails.gorm.tests.PersistenceEventListenerSpec > Test update events FAILED
>     java.lang.IllegalArgumentException
>
> grails.gorm.tests.PersistenceEventListenerSpec > Test insert events FAILED
>     java.lang.IllegalArgumentException
>
> grails.gorm.tests.PersistenceEventListenerSpec > Test load events FAILED
>     java.lang.IllegalArgumentException
>
> grails.gorm.tests.PersistenceEventListenerSpec > Test multi-load events FAILED
>     java.lang.IllegalArgumentException
>
> grails.gorm.tests.PersistenceEventListenerSpec > Test validation events FAILED
>     java.lang.IllegalArgumentException
>
> grails.gorm.tests.UniqueConstraintSpec > Test simple unique constraint FAILED
>     java.lang.IllegalArgumentException
>
> grails.gorm.tests.UniqueConstraintSpec > should update to a existing value fail FAILED
>     java.lang.IllegalArgumentException
>
> grails.gorm.tests.UniqueConstraintSpec > withManualFlushMode should use flushmode commit FAILED
>     java.lang.IllegalArgumentException
>
> grails.gorm.tests.GormEnhancerSpec > Test basic CRUD operations FAILED
>     java.lang.IllegalArgumentException
>
> grails.gorm.tests.GormEnhancerSpec > Test simple dynamic finder FAILED
>     java.lang.IllegalArgumentException
>
> grails.gorm.tests.GormEnhancerSpec > Test dynamic finder with disjunction FAILED
>     java.lang.IllegalArgumentException
>
> grails.gorm.tests.GormEnhancerSpec > Test getAll() method FAILED
>     java.lang.IllegalArgumentException
>
> grails.gorm.tests.GormEnhancerSpec > Test ident() method FAILED
>     java.lang.IllegalArgumentException
>
> grails.gorm.tests.GormEnhancerSpec > Test dynamic finder with pagination parameters FAILED
>     java.lang.IllegalArgumentException
>
> grails.gorm.tests.GormEnhancerSpec > Test in list query FAILED
>     java.lang.IllegalArgumentException
>
> grails.gorm.tests.GormEnhancerSpec > Test like query FAILED
>     java.lang.IllegalArgumentException
>
> grails.gorm.tests.GormEnhancerSpec > Test count by query FAILED
>     java.lang.IllegalArgumentException
>
> grails.gorm.tests.GormEnhancerSpec > Test dynamic finder with conjunction FAILED
>     java.lang.IllegalArgumentException
>
> grails.gorm.tests.GormEnhancerSpec > Test count() method FAILED
>     java.lang.IllegalArgumentException
>
> grails.gorm.tests.InheritanceSpec > Test inheritance with dynamic finder FAILED
>     java.lang.IllegalArgumentException
>
> grails.gorm.tests.QueryByNullSpec > Test passing null as the sole argument to a dynamic finder multiple times FAILED
>     java.lang.IllegalArgumentException
>
> grails.gorm.tests.RangeQuerySpec > Test between query with dates FAILED
>     java.lang.IllegalArgumentException
>
> grails.gorm.tests.RangeQuerySpec > Test between query FAILED
>     java.lang.IllegalArgumentException
>
> grails.gorm.tests.RangeQuerySpec > Test greater than or equal to and less than or equal to queries FAILED
>     java.lang.IllegalArgumentException
>
> grails.gorm.tests.RangeQuerySpec > Test InRange Dynamic Finder FAILED
>     java.lang.IllegalArgumentException
>
> grails.gorm.tests.AttachMethodSpec > Test attach method FAILED
>     java.lang.IllegalArgumentException
>
> grails.gorm.tests.DeleteAllSpec > Test that many objects can be deleted at once using multiple arguments FAILED
>     java.lang.IllegalArgumentException
>
> grails.gorm.tests.DeleteAllSpec > Test that many objects can be deleted using an iterable FAILED
>     java.lang.IllegalArgumentException
>
> grails.gorm.tests.CrudOperationsSpec > Test get using a string-based key FAILED
>     java.lang.IllegalArgumentException
>
> grails.gorm.tests.CrudOperationsSpec > Test get returns null of non-existent entity FAILED
>     java.lang.IllegalArgumentException
>
> grails.gorm.tests.CrudOperationsSpec > Test basic CRUD operations FAILED
>     java.lang.IllegalArgumentException
>
> grails.gorm.tests.CrudOperationsSpec > Test save method that takes a map FAILED
>     java.lang.IllegalArgumentException
>
> grails.gorm.tests.CrudOperationsSpec > Test failOnError FAILED
>     java.lang.IllegalArgumentException
>
> grails.gorm.tests.UpdateWithProxyPresentSpec > Test update entity with association proxies FAILED
>     java.lang.IllegalArgumentException
>
> grails.gorm.tests.UpdateWithProxyPresentSpec > Test update unidirectional oneToMany with proxy FAILED
>     java.lang.IllegalArgumentException
>
> grails.gorm.tests.CircularOneToManySpec > Test circular one-to-many FAILED
>     java.lang.IllegalArgumentException
>
> grails.gorm.tests.MultilineValueSpec > Test multivalue with slash n FAILED
>     java.lang.IllegalArgumentException
>
> grails.gorm.tests.MultilineValueSpec > Test multivalue with slash r slash n FAILED
>     java.lang.IllegalArgumentException
>
> grails.gorm.tests.EnumSpec > Test save() FAILED
>     java.lang.IllegalArgumentException
>
> grails.gorm.tests.EnumSpec > Test findByInList() FAILED
>     java.lang.IllegalArgumentException
>
> grails.gorm.tests.EnumSpec > Test findBy() FAILED
>     java.lang.IllegalArgumentException
>
> grails.gorm.tests.EnumSpec > Test findBy() with clearing the session FAILED
>     java.lang.IllegalArgumentException
>
> grails.gorm.tests.EnumSpec > Test findAllBy() FAILED
>     java.lang.IllegalArgumentException
>
> grails.gorm.tests.EnumSpec > Test countBy() FAILED
>     java.lang.IllegalArgumentException
>
> grails.gorm.tests.OptimisticLockingSpec > Test versioning FAILED
>     java.lang.IllegalArgumentException
>
> grails.gorm.tests.OptimisticLockingSpec > Test optimistic locking FAILED
>     java.lang.IllegalArgumentException
>
> grails.gorm.tests.OptimisticLockingSpec > Test optimistic locking disabled with 'version false' FAILED
>     java.lang.IllegalArgumentException
>
> grails.gorm.tests.ListOrderBySpec > Test listOrderBy property name method FAILED
>     java.lang.IllegalArgumentException
>
> grails.gorm.tests.ConstraintsSpec > Test constraints with static default values FAILED
>     java.lang.IllegalArgumentException
>
> grails.gorm.tests.FindByMethodSpec > Test Using AND Multiple Times In A Dynamic Finder FAILED
>     java.lang.IllegalArgumentException
>
> grails.gorm.tests.FindByMethodSpec > Test Using OR Multiple Times In A Dynamic Finder FAILED
>     java.lang.IllegalArgumentException
>
> grails.gorm.tests.FindByMethodSpec > testBooleanPropertyQuery FAILED
>     java.lang.IllegalArgumentException
>
> grails.gorm.tests.FindByMethodSpec > Test findOrCreateBy For A Record That Does Not Exist In The Database FAILED
>     java.lang.IllegalArgumentException
>
> grails.gorm.tests.FindByMethodSpec > Test findOrCreateBy With An AND Clause FAILED
>     java.lang.IllegalArgumentException
>
> grails.gorm.tests.FindByMethodSpec > Test findOrCreateBy Throws Exception If An OR Clause Is Used FAILED
>     java.lang.IllegalArgumentException
>
> grails.gorm.tests.FindByMethodSpec > Test findOrSaveBy For A Record That Does Not Exist In The Database FAILED
>     java.lang.IllegalArgumentException
>
> grails.gorm.tests.FindByMethodSpec > Test findOrSaveBy For A Record That Does Exist In The Database FAILED
>     java.lang.IllegalArgumentException
>
> grails.gorm.tests.FindByMethodSpec > Test patterns which shold throw MissingMethodException FAILED
>     java.lang.IllegalArgumentException
>
> grails.gorm.tests.ProxyLoadingSpec > Test load proxied instance directly FAILED
>     java.lang.IllegalArgumentException
>
> grails.gorm.tests.ProxyLoadingSpec > Test query using proxied association FAILED
>     java.lang.IllegalArgumentException
>
> grails.gorm.tests.SaveAllSpec > Test that many objects can be saved at once using multiple arguments FAILED
>     java.lang.IllegalArgumentException
>
> grails.gorm.tests.SaveAllSpec > Test that many objects can be saved at once using a list FAILED
>     java.lang.IllegalArgumentException
>
> grails.gorm.tests.SaveAllSpec > Test that many objects can be saved at once using an iterable FAILED
>     java.lang.IllegalArgumentException
>
> 169 tests completed, 156 failed, 9 skipped
> :grails-datastore-gorm-dynamodb:test FAILED
>
> FAILURE: Build failed with an exception.
>
> * What went wrong:
> Execution failed for task ':grails-datastore-gorm-dynamodb:test'.
> > There were failing tests. See the report at: file:///home/john/builds/grails/grails-data-mapping/grails-datastore-gorm-dynamodb/build/reports/tests/index.html
>
> * Try:
> Run with --stacktrace option to get the stack trace. Run with --info or --debug option to get more log output.
>
> BUILD FAILED
>
> Total time: 15.001 secs
>
>
> --
> You received this message because you are subscribed to the Google Groups "Grails Dev Discuss" group.
> To unsubscribe from this group and stop receiving emails from it, send an email to <a href="javascript:" target="_blank" gdf-obfuscated-mailto="jFyNlo-jCQAJ" rel="nofollow" onmousedown="this.href=&#39;javascript:&#39;;return true;" onclick="this.href=&#39;javascript:&#39;;return true;">grails-dev-discuss+unsubscribe@....
> To post to this group, send email to <a href="javascript:" target="_blank" gdf-obfuscated-mailto="jFyNlo-jCQAJ" rel="nofollow" onmousedown="this.href=&#39;javascript:&#39;;return true;" onclick="this.href=&#39;javascript:&#39;;return true;">grails-de...@googlegroups.com.
> To view this discussion on the web visit <a href="https://groups.google.com/d/msgid/grails-dev-discuss/f0541063-d856-49bd-9e13-c8d3049d82fc%40googlegroups.com" target="_blank" rel="nofollow" onmousedown="this.href=&#39;https://groups.google.com/d/msgid/grails-dev-discuss/f0541063-d856-49bd-9e13-c8d3049d82fc%40googlegroups.com&#39;;return true;" onclick="this.href=&#39;https://groups.google.com/d/msgid/grails-dev-discuss/f0541063-d856-49bd-9e13-c8d3049d82fc%40googlegroups.com&#39;;return true;">https://groups.google.com/d/msgid/grails-dev-discuss/f0541063-d856-49bd-9e13-c8d3049d82fc%40googlegroups.com.
> For more options, visit <a href="https://groups.google.com/d/optout" target="_blank" rel="nofollow" onmousedown="this.href=&#39;https://groups.google.com/d/optout&#39;;return true;" onclick="this.href=&#39;https://groups.google.com/d/optout&#39;;return true;">https://groups.google.com/d/optout.


Jeff Scott Brown
Principal Software Engineer
Grails Development Team
Object Computing Inc.
<a href="http://www.ociweb.com/" target="_blank" rel="nofollow" onmousedown="this.href=&#39;http://www.google.com/url?q\75http%3A%2F%2Fwww.ociweb.com%2F\46sa\75D\46sntz\0751\46usg\75AFQjCNGmJq4FzWg40kVUyr9KFZMiSj7t1Q&#39;;return true;" onclick="this.href=&#39;http://www.google.com/url?q\75http%3A%2F%2Fwww.ociweb.com%2F\46sa\75D\46sntz\0751\46usg\75AFQjCNGmJq4FzWg40kVUyr9KFZMiSj7t1Q&#39;;return true;">http://www.ociweb.com/

Autism Strikes 1 in 166
Find The Cause ~ Find The Cure
<a href="http://www.autismspeaks.org/" target="_blank" rel="nofollow" onmousedown="this.href=&#39;http://www.google.com/url?q\75http%3A%2F%2Fwww.autismspeaks.org%2F\46sa\75D\46sntz\0751\46usg\75AFQjCNHLOilSQBYB1lzLN6Ms6K6DtQY5DQ&#39;;return true;" onclick="this.href=&#39;http://www.google.com/url?q\75http%3A%2F%2Fwww.autismspeaks.org%2F\46sa\75D\46sntz\0751\46usg\75AFQjCNHLOilSQBYB1lzLN6Ms6K6DtQY5DQ&#39;;return true;">http://www.autismspeaks.org/

--
You received this message because you are subscribed to the Google Groups "Grails Dev Discuss" group.
To unsubscribe from this group and stop receiving emails from it, send an email to [hidden email].
To post to this group, send email to [hidden email].
To view this discussion on the web visit https://groups.google.com/d/msgid/grails-dev-discuss/7e162a41-7a40-4936-8b3e-3a5b42f931f7%40googlegroups.com.
For more options, visit https://groups.google.com/d/optout.
Loading...