grails 1.3.7 and multi-tenant

Previous Topic Next Topic
 
classic Classic list List threaded Threaded
7 messages Options
Reply | Threaded
Open this post in threaded view
|

grails 1.3.7 and multi-tenant

reset
I'm got next compilation error with grails 1.3.7 and Multi-Tenant (Core) 1.0.3 && falcone-util 1.0
With grails 1.3.5 all works fine.

Please help me or give any ideas how to resolve this.

A lot of thanks.

roovy:117)
        at _GrailsCompile_groovy$_run_closure4_closure10.doCall(_GrailsCompile_g
roovy)
        at _GrailsSettings_groovy$_run_closure10.doCall(_GrailsSettings_groovy:2
80)
        at _GrailsSettings_groovy$_run_closure10.call(_GrailsSettings_groovy)
        at _GrailsCompile_groovy$_run_closure4.doCall(_GrailsCompile_groovy:104)

        at _GrailsCompile_groovy$_run_closure3.doCall(_GrailsCompile_groovy:69)
        at _GrailsPackage_groovy$_run_closure2_closure9.doCall(_GrailsPackage_gr
oovy:85)
        at _GrailsPackage_groovy$_run_closure2_closure9.doCall(_GrailsPackage_gr
oovy)
        at _GrailsSettings_groovy$_run_closure10.doCall(_GrailsSettings_groovy:2
80)
        at _GrailsSettings_groovy$_run_closure10.call(_GrailsSettings_groovy)
        at _GrailsPackage_groovy$_run_closure2.doCall(_GrailsPackage_groovy:84)
        at RunApp$_run_closure1.doCall(RunApp.groovy:28)
        at gant.Gant$_dispatch_closure5.doCall(Gant.groovy:381)
        at gant.Gant$_dispatch_closure7.doCall(Gant.groovy:415)
        at gant.Gant$_dispatch_closure7.doCall(Gant.groovy)
        at gant.Gant.withBuildListeners(Gant.groovy:427)
        at gant.Gant.this$2$withBuildListeners(Gant.groovy)
        at gant.Gant$this$2$withBuildListeners.callCurrent(Unknown Source)
        at gant.Gant.dispatch(Gant.groovy:415)
        at gant.Gant.this$2$dispatch(Gant.groovy)
        at gant.Gant.invokeMethod(Gant.groovy)
        at gant.Gant.executeTargets(Gant.groovy:590)
        at gant.Gant.executeTargets(Gant.groovy:589)
: Compilation Failed
        at org.codehaus.groovy.ant.Groovyc.compile(Groovyc.java:920)
        at org.codehaus.groovy.ant.Groovyc.execute(Groovyc.java:607)
        at org.apache.tools.ant.UnknownElement.execute(UnknownElement.java:288)
        at org.apache.tools.ant.dispatch.DispatchUtils.execute(DispatchUtils.jav
a:106)
        at _GrailsCompile_groovy$_run_closure4_closure10.doCall(_GrailsCompile_g
roovy:117)
        at _GrailsCompile_groovy$_run_closure4_closure10.doCall(_GrailsCompile_g
roovy)
        at _GrailsSettings_groovy$_run_closure10.doCall(_GrailsSettings_groovy:2
80)
        at _GrailsSettings_groovy$_run_closure10.call(_GrailsSettings_groovy)
        at _GrailsCompile_groovy$_run_closure4.doCall(_GrailsCompile_groovy:104)

        at _GrailsCompile_groovy$_run_closure3.doCall(_GrailsCompile_groovy:69)
        at _GrailsPackage_groovy$_run_closure2_closure9.doCall(_GrailsPackage_gr
oovy:85)
        at _GrailsPackage_groovy$_run_closure2_closure9.doCall(_GrailsPackage_gr
oovy)
        at _GrailsSettings_groovy$_run_closure10.doCall(_GrailsSettings_groovy:2
80)
        at _GrailsSettings_groovy$_run_closure10.call(_GrailsSettings_groovy)
        at _GrailsPackage_groovy$_run_closure2.doCall(_GrailsPackage_groovy:84)
        at RunApp$_run_closure1.doCall(RunApp.groovy:28)
        at gant.Gant$_dispatch_closure5.doCall(Gant.groovy:381)
        at gant.Gant$_dispatch_closure7.doCall(Gant.groovy:415)
        at gant.Gant$_dispatch_closure7.doCall(Gant.groovy)
        at gant.Gant.withBuildListeners(Gant.groovy:427)
        at gant.Gant.this$2$withBuildListeners(Gant.groovy)
        at gant.Gant$this$2$withBuildListeners.callCurrent(Unknown Source)
        at gant.Gant.dispatch(Gant.groovy:415)
        at gant.Gant.this$2$dispatch(Gant.groovy)
        at gant.Gant.invokeMethod(Gant.groovy)
        at gant.Gant.executeTargets(Gant.groovy:590)
        at gant.Gant.executeTargets(Gant.groovy:589)
Caused by: org.codehaus.groovy.control.MultipleCompilationErrorsException: start
up failed:
Compile error during compilation with javac.
e:\project\plugins\falcone-util-1.0\src\java\util\Tre
eKey.java:3: warning: sun.misc.ASCIICaseInsensitiveComparator is Sun proprietary
 API and may be removed in a future release
import sun.misc.ASCIICaseInsensitiveComparator;
               ^
e:\project\plugins\falcone-util-1.0\src\java\com\infu
sion\util\domain\event\HibernateEventAdapter.java:143: cannot find symbol
symbol  : method handleEvent(java.lang.Object,org.hibernate.event.PreDeleteEvent
,java.lang.String)
location: class com.infusion.util.domain.event.HibernateEventAdapter
        return handleEvent(preDeleteEvent.getEntity(), preDeleteEvent, "preDelet
e");
               ^
e:\project\plugins\falcone-util-1.0\src\java\com\infu
sion\util\domain\event\HibernateEventAdapter.java:147: cannot find symbol
symbol  : method handleEvent(java.lang.Object,org.hibernate.event.PreInsertEvent
,java.lang.String)
location: class com.infusion.util.domain.event.HibernateEventAdapter
        return handleEvent(preInsertEvent.getEntity(), preInsertEvent, "preInser
t");
               ^
e:\project\plugins\falcone-util-1.0\src\java\com\infu
sion\util\domain\event\HibernateEventAdapter.java:155: cannot find symbol
symbol  : method handleEvent(java.lang.Object,org.hibernate.event.PreUpdateEvent
,java.lang.String)
location: class com.infusion.util.domain.event.HibernateEventAdapter
        return handleEvent(preUpdateEvent.getEntity(), preUpdateEvent, "preUpdat
e");
               ^
e:\project\plugins\falcone-util-1.0\src\java\com\infu
sion\util\domain\event\hibernate\InterceptableSession.java:71: cannot find symbo
l
symbol  : method doWork(org.hibernate.jdbc.Work)
location: interface org.hibernate.classic.Session
        session.doWork(work);
               ^
e:\project\plugins\falcone-util-1.0\src\java\com\infu
sion\util\domain\event\hibernate\InterceptableSessionFactory.java:40: com.infusi
on.util.domain.event.hibernate.InterceptableSessionFactory is not abstract and d
oes not override abstract method getSecondLevelCacheRegion(java.lang.String) in
org.hibernate.engine.SessionFactoryImplementor
public class InterceptableSessionFactory implements SessionFactory , SessionFact
oryImplementor{
       ^
e:\project\plugins\falcone-util-1.0\src\java\com\infu
sion\util\domain\event\hibernate\InterceptableSessionFactory.java:265: getSecond
LevelCacheRegion(java.lang.String) in com.infusion.util.domain.event.hibernate.I
nterceptableSessionFactory cannot implement getSecondLevelCacheRegion(java.lang.
String) in org.hibernate.engine.SessionFactoryImplementor; attempting to use inc
ompatible return type
found   : org.hibernate.cache.Region
required: org.hibernate.cache.Cache
    public Region getSecondLevelCacheRegion(String regionName) {
                  ^
e:\project\plugins\falcone-util-1.0\src\java\com\infu
sion\util\domain\event\hibernate\InterceptableSessionFactory.java:266: incompati
ble types
found   : org.hibernate.cache.Cache
required: org.hibernate.cache.Region
        return implementor.getSecondLevelCacheRegion(regionName);
                                                    ^
e:\project\plugins\falcone-util-1.0\src\java\util\Tre
eKey.java:18: warning: sun.misc.ASCIICaseInsensitiveComparator is Sun proprietar
y API and may be removed in a future release
    private static final Comparator STRING_COMPARATOR = new ASCIICaseInsensitive
Comparator();
                                                            ^
Note: Some input files use or override a deprecated API.
Note: Recompile with -Xlint:deprecation for details.
Note: Some input files use unchecked or unsafe operations.
Note: Recompile with -Xlint:unchecked for details.
7 errors
2 warnings


1 error

        at org.codehaus.groovy.control.ErrorCollector.failIfErrors(ErrorCollecto
r.java:302)
        at org.codehaus.groovy.control.ErrorCollector.addFatalError(ErrorCollect
or.java:149)
        at org.codehaus.groovy.tools.javac.JavacJavaCompiler.addJavacError(Javac
JavaCompiler.java:92)
        at org.codehaus.groovy.tools.javac.JavacJavaCompiler.compile(JavacJavaCo
mpiler.java:71)
        at org.codehaus.groovy.tools.javac.JavaAwareCompilationUnit.gotoPhase(Ja
vaAwareCompilationUnit.java:94)
        at org.codehaus.groovy.control.CompilationUnit.compile(CompilationUnit.j
ava:484)
        at org.codehaus.groovy.control.CompilationUnit.compile(CompilationUnit.j
ava:453)
        at org.codehaus.groovy.tools.FileSystemCompiler.compile(FileSystemCompil
er.java:67)
        at org.codehaus.groovy.tools.FileSystemCompiler.doCompilation(FileSystem
Compiler.java:180)
        at org.codehaus.groovy.ant.Groovyc.compile(Groovyc.java:905)
        ... 26 more
--- Nested Exception ---
org.codehaus.groovy.control.MultipleCompilationErrorsException: startup failed:
Compile error during compilation with javac.
e:\project\plugins\falcone-util-1.0\src\java\util\Tre
eKey.java:3: warning: sun.misc.ASCIICaseInsensitiveComparator is Sun proprietary
 API and may be removed in a future release
import sun.misc.ASCIICaseInsensitiveComparator;
               ^
e:\project\plugins\falcone-util-1.0\src\java\com\infu
sion\util\domain\event\HibernateEventAdapter.java:143: cannot find symbol
symbol  : method handleEvent(java.lang.Object,org.hibernate.event.PreDeleteEvent
,java.lang.String)
location: class com.infusion.util.domain.event.HibernateEventAdapter
        return handleEvent(preDeleteEvent.getEntity(), preDeleteEvent, "preDelet
e");
               ^
e:\project\plugins\falcone-util-1.0\src\java\com\infu
sion\util\domain\event\HibernateEventAdapter.java:147: cannot find symbol
symbol  : method handleEvent(java.lang.Object,org.hibernate.event.PreInsertEvent
,java.lang.String)
location: class com.infusion.util.domain.event.HibernateEventAdapter
        return handleEvent(preInsertEvent.getEntity(), preInsertEvent, "preInser
t");
               ^
e:\project\plugins\falcone-util-1.0\src\java\com\infu
sion\util\domain\event\HibernateEventAdapter.java:155: cannot find symbol
symbol  : method handleEvent(java.lang.Object,org.hibernate.event.PreUpdateEvent
,java.lang.String)
location: class com.infusion.util.domain.event.HibernateEventAdapter
        return handleEvent(preUpdateEvent.getEntity(), preUpdateEvent, "preUpdat
e");
               ^
e:\project\plugins\falcone-util-1.0\src\java\com\infu
sion\util\domain\event\hibernate\InterceptableSession.java:71: cannot find symbo
l
symbol  : method doWork(org.hibernate.jdbc.Work)
location: interface org.hibernate.classic.Session
        session.doWork(work);
               ^
e:\project\plugins\falcone-util-1.0\src\java\com\infu
sion\util\domain\event\hibernate\InterceptableSessionFactory.java:40: com.infusi
on.util.domain.event.hibernate.InterceptableSessionFactory is not abstract and d
oes not override abstract method getSecondLevelCacheRegion(java.lang.String) in
org.hibernate.engine.SessionFactoryImplementor
public class InterceptableSessionFactory implements SessionFactory , SessionFact
oryImplementor{
       ^
e:\project\plugins\falcone-util-1.0\src\java\com\infu
sion\util\domain\event\hibernate\InterceptableSessionFactory.java:265: getSecond
LevelCacheRegion(java.lang.String) in com.infusion.util.domain.event.hibernate.I
nterceptableSessionFactory cannot implement getSecondLevelCacheRegion(java.lang.
String) in org.hibernate.engine.SessionFactoryImplementor; attempting to use inc
ompatible return type
found   : org.hibernate.cache.Region
required: org.hibernate.cache.Cache
    public Region getSecondLevelCacheRegion(String regionName) {
                  ^
e:\project\plugins\falcone-util-1.0\src\java\com\infu
sion\util\domain\event\hibernate\InterceptableSessionFactory.java:266: incompati
ble types
found   : org.hibernate.cache.Cache
required: org.hibernate.cache.Region
        return implementor.getSecondLevelCacheRegion(regionName);
                                                    ^
e:\project\plugins\falcone-util-1.0\src\java\util\Tre
eKey.java:18: warning: sun.misc.ASCIICaseInsensitiveComparator is Sun proprietar
y API and may be removed in a future release
    private static final Comparator STRING_COMPARATOR = new ASCIICaseInsensitive
Comparator();
                                                            ^
Note: Some input files use or override a deprecated API.
Note: Recompile with -Xlint:deprecation for details.
Note: Some input files use unchecked or unsafe operations.
Note: Recompile with -Xlint:unchecked for details.
7 errors
2 warnings


1 error

        at org.codehaus.groovy.control.ErrorCollector.failIfErrors(ErrorCollecto
r.java:302)
        at org.codehaus.groovy.control.ErrorCollector.addFatalError(ErrorCollect
or.java:149)
        at org.codehaus.groovy.tools.javac.JavacJavaCompiler.addJavacError(Javac
JavaCompiler.java:92)
        at org.codehaus.groovy.tools.javac.JavacJavaCompiler.compile(JavacJavaCo
mpiler.java:71)
        at org.codehaus.groovy.tools.javac.JavaAwareCompilationUnit.gotoPhase(Ja
vaAwareCompilationUnit.java:94)
        at org.codehaus.groovy.control.CompilationUnit.compile(CompilationUnit.j
ava:484)
        at org.codehaus.groovy.control.CompilationUnit.compile(CompilationUnit.j
ava:453)
        at org.codehaus.groovy.tools.FileSystemCompiler.compile(FileSystemCompil
er.java:67)
        at org.codehaus.groovy.tools.FileSystemCompiler.doCompilation(FileSystem
Compiler.java:180)
        at org.codehaus.groovy.ant.Groovyc.compile(Groovyc.java:905)
        at org.codehaus.groovy.ant.Groovyc.execute(Groovyc.java:607)
        at org.apache.tools.ant.UnknownElement.execute(UnknownElement.java:288)
        at org.apache.tools.ant.dispatch.DispatchUtils.execute(DispatchUtils.jav
a:106)
        at _GrailsCompile_groovy$_run_closure4_closure10.doCall(_GrailsCompile_g
roovy:117)
        at _GrailsCompile_groovy$_run_closure4_closure10.doCall(_GrailsCompile_g
roovy)
        at _GrailsSettings_groovy$_run_closure10.doCall(_GrailsSettings_groovy:2
80)
        at _GrailsSettings_groovy$_run_closure10.call(_GrailsSettings_groovy)
        at _GrailsCompile_groovy$_run_closure4.doCall(_GrailsCompile_groovy:104)

        at _GrailsCompile_groovy$_run_closure3.doCall(_GrailsCompile_groovy:69)
        at _GrailsPackage_groovy$_run_closure2_closure9.doCall(_GrailsPackage_gr
oovy:85)
        at _GrailsPackage_groovy$_run_closure2_closure9.doCall(_GrailsPackage_gr
oovy)
        at _GrailsSettings_groovy$_run_closure10.doCall(_GrailsSettings_groovy:2
80)
        at _GrailsSettings_groovy$_run_closure10.call(_GrailsSettings_groovy)
        at _GrailsPackage_groovy$_run_closure2.doCall(_GrailsPackage_groovy:84)
        at RunApp$_run_closure1.doCall(RunApp.groovy:28)
        at gant.Gant$_dispatch_closure5.doCall(Gant.groovy:381)
        at gant.Gant$_dispatch_closure7.doCall(Gant.groovy:415)
        at gant.Gant$_dispatch_closure7.doCall(Gant.groovy)
        at gant.Gant.withBuildListeners(Gant.groovy:427)
        at gant.Gant.this$2$withBuildListeners(Gant.groovy)
        at gant.Gant$this$2$withBuildListeners.callCurrent(Unknown Source)
        at gant.Gant.dispatch(Gant.groovy:415)
        at gant.Gant.this$2$dispatch(Gant.groovy)
        at gant.Gant.invokeMethod(Gant.groovy)
        at gant.Gant.executeTargets(Gant.groovy:590)
        at gant.Gant.executeTargets(Gant.groovy:589)
Compilation error: Compilation Failed
e:\project>
Reply | Threaded
Open this post in threaded view
|

Re: grails 1.3.7 and multi-tenant

xmly
Seems quite like the errors I met with spring acl plugin on 1.3.7.
The import does not work.

On Wed, Feb 16, 2011 at 5:06 PM, reset <[hidden email]> wrote:

I'm got next compilation error with grails 1.3.7 and Multi-Tenant (Core)
1.0.3 && falcone-util 1.0
With grails 1.3.5 all works fine.

Please help me or give any ideas how to resolve this.

A lot of thanks.

roovy:117)
       at
_GrailsCompile_groovy$_run_closure4_closure10.doCall(_GrailsCompile_g
roovy)
       at
_GrailsSettings_groovy$_run_closure10.doCall(_GrailsSettings_groovy:2
80)
       at
_GrailsSettings_groovy$_run_closure10.call(_GrailsSettings_groovy)
       at
_GrailsCompile_groovy$_run_closure4.doCall(_GrailsCompile_groovy:104)

       at
_GrailsCompile_groovy$_run_closure3.doCall(_GrailsCompile_groovy:69)
       at
_GrailsPackage_groovy$_run_closure2_closure9.doCall(_GrailsPackage_gr
oovy:85)
       at
_GrailsPackage_groovy$_run_closure2_closure9.doCall(_GrailsPackage_gr
oovy)
       at
_GrailsSettings_groovy$_run_closure10.doCall(_GrailsSettings_groovy:2
80)
       at
_GrailsSettings_groovy$_run_closure10.call(_GrailsSettings_groovy)
       at
_GrailsPackage_groovy$_run_closure2.doCall(_GrailsPackage_groovy:84)
       at RunApp$_run_closure1.doCall(RunApp.groovy:28)
       at gant.Gant$_dispatch_closure5.doCall(Gant.groovy:381)
       at gant.Gant$_dispatch_closure7.doCall(Gant.groovy:415)
       at gant.Gant$_dispatch_closure7.doCall(Gant.groovy)
       at gant.Gant.withBuildListeners(Gant.groovy:427)
       at gant.Gant.this$2$withBuildListeners(Gant.groovy)
       at gant.Gant$this$2$withBuildListeners.callCurrent(Unknown Source)
       at gant.Gant.dispatch(Gant.groovy:415)
       at gant.Gant.this$2$dispatch(Gant.groovy)
       at gant.Gant.invokeMethod(Gant.groovy)
       at gant.Gant.executeTargets(Gant.groovy:590)
       at gant.Gant.executeTargets(Gant.groovy:589)
: Compilation Failed
       at org.codehaus.groovy.ant.Groovyc.compile(Groovyc.java:920)
       at org.codehaus.groovy.ant.Groovyc.execute(Groovyc.java:607)
       at
org.apache.tools.ant.UnknownElement.execute(UnknownElement.java:288)
       at
org.apache.tools.ant.dispatch.DispatchUtils.execute(DispatchUtils.jav
a:106)
       at
_GrailsCompile_groovy$_run_closure4_closure10.doCall(_GrailsCompile_g
roovy:117)
       at
_GrailsCompile_groovy$_run_closure4_closure10.doCall(_GrailsCompile_g
roovy)
       at
_GrailsSettings_groovy$_run_closure10.doCall(_GrailsSettings_groovy:2
80)
       at
_GrailsSettings_groovy$_run_closure10.call(_GrailsSettings_groovy)
       at
_GrailsCompile_groovy$_run_closure4.doCall(_GrailsCompile_groovy:104)

       at
_GrailsCompile_groovy$_run_closure3.doCall(_GrailsCompile_groovy:69)
       at
_GrailsPackage_groovy$_run_closure2_closure9.doCall(_GrailsPackage_gr
oovy:85)
       at
_GrailsPackage_groovy$_run_closure2_closure9.doCall(_GrailsPackage_gr
oovy)
       at
_GrailsSettings_groovy$_run_closure10.doCall(_GrailsSettings_groovy:2
80)
       at
_GrailsSettings_groovy$_run_closure10.call(_GrailsSettings_groovy)
       at
_GrailsPackage_groovy$_run_closure2.doCall(_GrailsPackage_groovy:84)
       at RunApp$_run_closure1.doCall(RunApp.groovy:28)
       at gant.Gant$_dispatch_closure5.doCall(Gant.groovy:381)
       at gant.Gant$_dispatch_closure7.doCall(Gant.groovy:415)
       at gant.Gant$_dispatch_closure7.doCall(Gant.groovy)
       at gant.Gant.withBuildListeners(Gant.groovy:427)
       at gant.Gant.this$2$withBuildListeners(Gant.groovy)
       at gant.Gant$this$2$withBuildListeners.callCurrent(Unknown Source)
       at gant.Gant.dispatch(Gant.groovy:415)
       at gant.Gant.this$2$dispatch(Gant.groovy)
       at gant.Gant.invokeMethod(Gant.groovy)
       at gant.Gant.executeTargets(Gant.groovy:590)
       at gant.Gant.executeTargets(Gant.groovy:589)
Caused by: org.codehaus.groovy.control.MultipleCompilationErrorsException:
start
up failed:
Compile error during compilation with javac.
e:\project\plugins\falcone-util-1.0\src\java\util\Tre
eKey.java:3: warning: sun.misc.ASCIICaseInsensitiveComparator is Sun
proprietary
 API and may be removed in a future release
import sun.misc.ASCIICaseInsensitiveComparator;
              ^
e:\project\plugins\falcone-util-1.0\src\java\com\infu
sion\util\domain\event\HibernateEventAdapter.java:143: cannot find symbol
symbol  : method
handleEvent(java.lang.Object,org.hibernate.event.PreDeleteEvent
,java.lang.String)
location: class com.infusion.util.domain.event.HibernateEventAdapter
       return handleEvent(preDeleteEvent.getEntity(), preDeleteEvent,
"preDelet
e");
              ^
e:\project\plugins\falcone-util-1.0\src\java\com\infu
sion\util\domain\event\HibernateEventAdapter.java:147: cannot find symbol
symbol  : method
handleEvent(java.lang.Object,org.hibernate.event.PreInsertEvent
,java.lang.String)
location: class com.infusion.util.domain.event.HibernateEventAdapter
       return handleEvent(preInsertEvent.getEntity(), preInsertEvent,
"preInser
t");
              ^
e:\project\plugins\falcone-util-1.0\src\java\com\infu
sion\util\domain\event\HibernateEventAdapter.java:155: cannot find symbol
symbol  : method
handleEvent(java.lang.Object,org.hibernate.event.PreUpdateEvent
,java.lang.String)
location: class com.infusion.util.domain.event.HibernateEventAdapter
       return handleEvent(preUpdateEvent.getEntity(), preUpdateEvent,
"preUpdat
e");
              ^
e:\project\plugins\falcone-util-1.0\src\java\com\infu
sion\util\domain\event\hibernate\InterceptableSession.java:71: cannot find
symbo
l
symbol  : method doWork(org.hibernate.jdbc.Work)
location: interface org.hibernate.classic.Session
       session.doWork(work);
              ^
e:\project\plugins\falcone-util-1.0\src\java\com\infu
sion\util\domain\event\hibernate\InterceptableSessionFactory.java:40:
com.infusi
on.util.domain.event.hibernate.InterceptableSessionFactory is not abstract
and d
oes not override abstract method getSecondLevelCacheRegion(java.lang.String)
in
org.hibernate.engine.SessionFactoryImplementor
public class InterceptableSessionFactory implements SessionFactory ,
SessionFact
oryImplementor{
      ^
e:\project\plugins\falcone-util-1.0\src\java\com\infu
sion\util\domain\event\hibernate\InterceptableSessionFactory.java:265:
getSecond
LevelCacheRegion(java.lang.String) in
com.infusion.util.domain.event.hibernate.I
nterceptableSessionFactory cannot implement
getSecondLevelCacheRegion(java.lang.
String) in org.hibernate.engine.SessionFactoryImplementor; attempting to use
inc
ompatible return type
found   : org.hibernate.cache.Region
required: org.hibernate.cache.Cache
   public Region getSecondLevelCacheRegion(String regionName) {
                 ^
e:\project\plugins\falcone-util-1.0\src\java\com\infu
sion\util\domain\event\hibernate\InterceptableSessionFactory.java:266:
incompati
ble types
found   : org.hibernate.cache.Cache
required: org.hibernate.cache.Region
       return implementor.getSecondLevelCacheRegion(regionName);
                                                   ^
e:\project\plugins\falcone-util-1.0\src\java\util\Tre
eKey.java:18: warning: sun.misc.ASCIICaseInsensitiveComparator is Sun
proprietar
y API and may be removed in a future release
   private static final Comparator STRING_COMPARATOR = new
ASCIICaseInsensitive
Comparator();
                                                           ^
Note: Some input files use or override a deprecated API.
Note: Recompile with -Xlint:deprecation for details.
Note: Some input files use unchecked or unsafe operations.
Note: Recompile with -Xlint:unchecked for details.
7 errors
2 warnings


1 error

       at
org.codehaus.groovy.control.ErrorCollector.failIfErrors(ErrorCollecto
r.java:302)
       at
org.codehaus.groovy.control.ErrorCollector.addFatalError(ErrorCollect
or.java:149)
       at
org.codehaus.groovy.tools.javac.JavacJavaCompiler.addJavacError(Javac
JavaCompiler.java:92)
       at
org.codehaus.groovy.tools.javac.JavacJavaCompiler.compile(JavacJavaCo
mpiler.java:71)
       at
org.codehaus.groovy.tools.javac.JavaAwareCompilationUnit.gotoPhase(Ja
vaAwareCompilationUnit.java:94)
       at
org.codehaus.groovy.control.CompilationUnit.compile(CompilationUnit.j
ava:484)
       at
org.codehaus.groovy.control.CompilationUnit.compile(CompilationUnit.j
ava:453)
       at
org.codehaus.groovy.tools.FileSystemCompiler.compile(FileSystemCompil
er.java:67)
       at
org.codehaus.groovy.tools.FileSystemCompiler.doCompilation(FileSystem
Compiler.java:180)
       at org.codehaus.groovy.ant.Groovyc.compile(Groovyc.java:905)
       ... 26 more
--- Nested Exception ---
org.codehaus.groovy.control.MultipleCompilationErrorsException: startup
failed:
Compile error during compilation with javac.
e:\project\plugins\falcone-util-1.0\src\java\util\Tre
eKey.java:3: warning: sun.misc.ASCIICaseInsensitiveComparator is Sun
proprietary
 API and may be removed in a future release
import sun.misc.ASCIICaseInsensitiveComparator;
              ^
e:\project\plugins\falcone-util-1.0\src\java\com\infu
sion\util\domain\event\HibernateEventAdapter.java:143: cannot find symbol
symbol  : method
handleEvent(java.lang.Object,org.hibernate.event.PreDeleteEvent
,java.lang.String)
location: class com.infusion.util.domain.event.HibernateEventAdapter
       return handleEvent(preDeleteEvent.getEntity(), preDeleteEvent,
"preDelet
e");
              ^
e:\project\plugins\falcone-util-1.0\src\java\com\infu
sion\util\domain\event\HibernateEventAdapter.java:147: cannot find symbol
symbol  : method
handleEvent(java.lang.Object,org.hibernate.event.PreInsertEvent
,java.lang.String)
location: class com.infusion.util.domain.event.HibernateEventAdapter
       return handleEvent(preInsertEvent.getEntity(), preInsertEvent,
"preInser
t");
              ^
e:\project\plugins\falcone-util-1.0\src\java\com\infu
sion\util\domain\event\HibernateEventAdapter.java:155: cannot find symbol
symbol  : method
handleEvent(java.lang.Object,org.hibernate.event.PreUpdateEvent
,java.lang.String)
location: class com.infusion.util.domain.event.HibernateEventAdapter
       return handleEvent(preUpdateEvent.getEntity(), preUpdateEvent,
"preUpdat
e");
              ^
e:\project\plugins\falcone-util-1.0\src\java\com\infu
sion\util\domain\event\hibernate\InterceptableSession.java:71: cannot find
symbo
l
symbol  : method doWork(org.hibernate.jdbc.Work)
location: interface org.hibernate.classic.Session
       session.doWork(work);
              ^
e:\project\plugins\falcone-util-1.0\src\java\com\infu
sion\util\domain\event\hibernate\InterceptableSessionFactory.java:40:
com.infusi
on.util.domain.event.hibernate.InterceptableSessionFactory is not abstract
and d
oes not override abstract method getSecondLevelCacheRegion(java.lang.String)
in
org.hibernate.engine.SessionFactoryImplementor
public class InterceptableSessionFactory implements SessionFactory ,
SessionFact
oryImplementor{
      ^
e:\project\plugins\falcone-util-1.0\src\java\com\infu
sion\util\domain\event\hibernate\InterceptableSessionFactory.java:265:
getSecond
LevelCacheRegion(java.lang.String) in
com.infusion.util.domain.event.hibernate.I
nterceptableSessionFactory cannot implement
getSecondLevelCacheRegion(java.lang.
String) in org.hibernate.engine.SessionFactoryImplementor; attempting to use
inc
ompatible return type
found   : org.hibernate.cache.Region
required: org.hibernate.cache.Cache
   public Region getSecondLevelCacheRegion(String regionName) {
                 ^
e:\project\plugins\falcone-util-1.0\src\java\com\infu
sion\util\domain\event\hibernate\InterceptableSessionFactory.java:266:
incompati
ble types
found   : org.hibernate.cache.Cache
required: org.hibernate.cache.Region
       return implementor.getSecondLevelCacheRegion(regionName);
                                                   ^
e:\project\plugins\falcone-util-1.0\src\java\util\Tre
eKey.java:18: warning: sun.misc.ASCIICaseInsensitiveComparator is Sun
proprietar
y API and may be removed in a future release
   private static final Comparator STRING_COMPARATOR = new
ASCIICaseInsensitive
Comparator();
                                                           ^
Note: Some input files use or override a deprecated API.
Note: Recompile with -Xlint:deprecation for details.
Note: Some input files use unchecked or unsafe operations.
Note: Recompile with -Xlint:unchecked for details.
7 errors
2 warnings


1 error

       at
org.codehaus.groovy.control.ErrorCollector.failIfErrors(ErrorCollecto
r.java:302)
       at
org.codehaus.groovy.control.ErrorCollector.addFatalError(ErrorCollect
or.java:149)
       at
org.codehaus.groovy.tools.javac.JavacJavaCompiler.addJavacError(Javac
JavaCompiler.java:92)
       at
org.codehaus.groovy.tools.javac.JavacJavaCompiler.compile(JavacJavaCo
mpiler.java:71)
       at
org.codehaus.groovy.tools.javac.JavaAwareCompilationUnit.gotoPhase(Ja
vaAwareCompilationUnit.java:94)
       at
org.codehaus.groovy.control.CompilationUnit.compile(CompilationUnit.j
ava:484)
       at
org.codehaus.groovy.control.CompilationUnit.compile(CompilationUnit.j
ava:453)
       at
org.codehaus.groovy.tools.FileSystemCompiler.compile(FileSystemCompil
er.java:67)
       at
org.codehaus.groovy.tools.FileSystemCompiler.doCompilation(FileSystem
Compiler.java:180)
       at org.codehaus.groovy.ant.Groovyc.compile(Groovyc.java:905)
       at org.codehaus.groovy.ant.Groovyc.execute(Groovyc.java:607)
       at
org.apache.tools.ant.UnknownElement.execute(UnknownElement.java:288)
       at
org.apache.tools.ant.dispatch.DispatchUtils.execute(DispatchUtils.jav
a:106)
       at
_GrailsCompile_groovy$_run_closure4_closure10.doCall(_GrailsCompile_g
roovy:117)
       at
_GrailsCompile_groovy$_run_closure4_closure10.doCall(_GrailsCompile_g
roovy)
       at
_GrailsSettings_groovy$_run_closure10.doCall(_GrailsSettings_groovy:2
80)
       at
_GrailsSettings_groovy$_run_closure10.call(_GrailsSettings_groovy)
       at
_GrailsCompile_groovy$_run_closure4.doCall(_GrailsCompile_groovy:104)

       at
_GrailsCompile_groovy$_run_closure3.doCall(_GrailsCompile_groovy:69)
       at
_GrailsPackage_groovy$_run_closure2_closure9.doCall(_GrailsPackage_gr
oovy:85)
       at
_GrailsPackage_groovy$_run_closure2_closure9.doCall(_GrailsPackage_gr
oovy)
       at
_GrailsSettings_groovy$_run_closure10.doCall(_GrailsSettings_groovy:2
80)
       at
_GrailsSettings_groovy$_run_closure10.call(_GrailsSettings_groovy)
       at
_GrailsPackage_groovy$_run_closure2.doCall(_GrailsPackage_groovy:84)
       at RunApp$_run_closure1.doCall(RunApp.groovy:28)
       at gant.Gant$_dispatch_closure5.doCall(Gant.groovy:381)
       at gant.Gant$_dispatch_closure7.doCall(Gant.groovy:415)
       at gant.Gant$_dispatch_closure7.doCall(Gant.groovy)
       at gant.Gant.withBuildListeners(Gant.groovy:427)
       at gant.Gant.this$2$withBuildListeners(Gant.groovy)
       at gant.Gant$this$2$withBuildListeners.callCurrent(Unknown Source)
       at gant.Gant.dispatch(Gant.groovy:415)
       at gant.Gant.this$2$dispatch(Gant.groovy)
       at gant.Gant.invokeMethod(Gant.groovy)
       at gant.Gant.executeTargets(Gant.groovy:590)
       at gant.Gant.executeTargets(Gant.groovy:589)
Compilation error: Compilation Failed
e:\project>
--
View this message in context: http://grails.1312388.n4.nabble.com/grails-1-3-7-and-multi-tenant-tp3309836p3309836.html
Sent from the Grails - user mailing list archive at Nabble.com.

---------------------------------------------------------------------
To unsubscribe from this list, please visit:

   http://xircles.codehaus.org/manage_email



Reply | Threaded
Open this post in threaded view
|

Re: grails 1.3.7 and multi-tenant

scryan
In reply to this post by reset
1.3.7 came out today and we are still testing the multi tenant plugin on it.  It will be a few days before we can finish the tests and release a version for 1.3.7

1.3.6 is the last version that it is supported on.

Scott Ryan

On Feb 16, 2011, at 3:06 PM, reset wrote:

>
> I'm got next compilation error with grails 1.3.7 and Multi-Tenant (Core)
> 1.0.3 && falcone-util 1.0
> With grails 1.3.5 all works fine.
>
> Please help me or give any ideas how to resolve this.
>
> A lot of thanks.
>
> roovy:117)
>        at
> _GrailsCompile_groovy$_run_closure4_closure10.doCall(_GrailsCompile_g
> roovy)
>        at
> _GrailsSettings_groovy$_run_closure10.doCall(_GrailsSettings_groovy:2
> 80)
>        at
> _GrailsSettings_groovy$_run_closure10.call(_GrailsSettings_groovy)
>        at
> _GrailsCompile_groovy$_run_closure4.doCall(_GrailsCompile_groovy:104)
>
>        at
> _GrailsCompile_groovy$_run_closure3.doCall(_GrailsCompile_groovy:69)
>        at
> _GrailsPackage_groovy$_run_closure2_closure9.doCall(_GrailsPackage_gr
> oovy:85)
>        at
> _GrailsPackage_groovy$_run_closure2_closure9.doCall(_GrailsPackage_gr
> oovy)
>        at
> _GrailsSettings_groovy$_run_closure10.doCall(_GrailsSettings_groovy:2
> 80)
>        at
> _GrailsSettings_groovy$_run_closure10.call(_GrailsSettings_groovy)
>        at
> _GrailsPackage_groovy$_run_closure2.doCall(_GrailsPackage_groovy:84)
>        at RunApp$_run_closure1.doCall(RunApp.groovy:28)
>        at gant.Gant$_dispatch_closure5.doCall(Gant.groovy:381)
>        at gant.Gant$_dispatch_closure7.doCall(Gant.groovy:415)
>        at gant.Gant$_dispatch_closure7.doCall(Gant.groovy)
>        at gant.Gant.withBuildListeners(Gant.groovy:427)
>        at gant.Gant.this$2$withBuildListeners(Gant.groovy)
>        at gant.Gant$this$2$withBuildListeners.callCurrent(Unknown Source)
>        at gant.Gant.dispatch(Gant.groovy:415)
>        at gant.Gant.this$2$dispatch(Gant.groovy)
>        at gant.Gant.invokeMethod(Gant.groovy)
>        at gant.Gant.executeTargets(Gant.groovy:590)
>        at gant.Gant.executeTargets(Gant.groovy:589)
> : Compilation Failed
>        at org.codehaus.groovy.ant.Groovyc.compile(Groovyc.java:920)
>        at org.codehaus.groovy.ant.Groovyc.execute(Groovyc.java:607)
>        at
> org.apache.tools.ant.UnknownElement.execute(UnknownElement.java:288)
>        at
> org.apache.tools.ant.dispatch.DispatchUtils.execute(DispatchUtils.jav
> a:106)
>        at
> _GrailsCompile_groovy$_run_closure4_closure10.doCall(_GrailsCompile_g
> roovy:117)
>        at
> _GrailsCompile_groovy$_run_closure4_closure10.doCall(_GrailsCompile_g
> roovy)
>        at
> _GrailsSettings_groovy$_run_closure10.doCall(_GrailsSettings_groovy:2
> 80)
>        at
> _GrailsSettings_groovy$_run_closure10.call(_GrailsSettings_groovy)
>        at
> _GrailsCompile_groovy$_run_closure4.doCall(_GrailsCompile_groovy:104)
>
>        at
> _GrailsCompile_groovy$_run_closure3.doCall(_GrailsCompile_groovy:69)
>        at
> _GrailsPackage_groovy$_run_closure2_closure9.doCall(_GrailsPackage_gr
> oovy:85)
>        at
> _GrailsPackage_groovy$_run_closure2_closure9.doCall(_GrailsPackage_gr
> oovy)
>        at
> _GrailsSettings_groovy$_run_closure10.doCall(_GrailsSettings_groovy:2
> 80)
>        at
> _GrailsSettings_groovy$_run_closure10.call(_GrailsSettings_groovy)
>        at
> _GrailsPackage_groovy$_run_closure2.doCall(_GrailsPackage_groovy:84)
>        at RunApp$_run_closure1.doCall(RunApp.groovy:28)
>        at gant.Gant$_dispatch_closure5.doCall(Gant.groovy:381)
>        at gant.Gant$_dispatch_closure7.doCall(Gant.groovy:415)
>        at gant.Gant$_dispatch_closure7.doCall(Gant.groovy)
>        at gant.Gant.withBuildListeners(Gant.groovy:427)
>        at gant.Gant.this$2$withBuildListeners(Gant.groovy)
>        at gant.Gant$this$2$withBuildListeners.callCurrent(Unknown Source)
>        at gant.Gant.dispatch(Gant.groovy:415)
>        at gant.Gant.this$2$dispatch(Gant.groovy)
>        at gant.Gant.invokeMethod(Gant.groovy)
>        at gant.Gant.executeTargets(Gant.groovy:590)
>        at gant.Gant.executeTargets(Gant.groovy:589)
> Caused by: org.codehaus.groovy.control.MultipleCompilationErrorsException:
> start
> up failed:
> Compile error during compilation with javac.
> e:\project\plugins\falcone-util-1.0\src\java\util\Tre
> eKey.java:3: warning: sun.misc.ASCIICaseInsensitiveComparator is Sun
> proprietary
> API and may be removed in a future release
> import sun.misc.ASCIICaseInsensitiveComparator;
>               ^
> e:\project\plugins\falcone-util-1.0\src\java\com\infu
> sion\util\domain\event\HibernateEventAdapter.java:143: cannot find symbol
> symbol  : method
> handleEvent(java.lang.Object,org.hibernate.event.PreDeleteEvent
> ,java.lang.String)
> location: class com.infusion.util.domain.event.HibernateEventAdapter
>        return handleEvent(preDeleteEvent.getEntity(), preDeleteEvent,
> "preDelet
> e");
>               ^
> e:\project\plugins\falcone-util-1.0\src\java\com\infu
> sion\util\domain\event\HibernateEventAdapter.java:147: cannot find symbol
> symbol  : method
> handleEvent(java.lang.Object,org.hibernate.event.PreInsertEvent
> ,java.lang.String)
> location: class com.infusion.util.domain.event.HibernateEventAdapter
>        return handleEvent(preInsertEvent.getEntity(), preInsertEvent,
> "preInser
> t");
>               ^
> e:\project\plugins\falcone-util-1.0\src\java\com\infu
> sion\util\domain\event\HibernateEventAdapter.java:155: cannot find symbol
> symbol  : method
> handleEvent(java.lang.Object,org.hibernate.event.PreUpdateEvent
> ,java.lang.String)
> location: class com.infusion.util.domain.event.HibernateEventAdapter
>        return handleEvent(preUpdateEvent.getEntity(), preUpdateEvent,
> "preUpdat
> e");
>               ^
> e:\project\plugins\falcone-util-1.0\src\java\com\infu
> sion\util\domain\event\hibernate\InterceptableSession.java:71: cannot find
> symbo
> l
> symbol  : method doWork(org.hibernate.jdbc.Work)
> location: interface org.hibernate.classic.Session
>        session.doWork(work);
>               ^
> e:\project\plugins\falcone-util-1.0\src\java\com\infu
> sion\util\domain\event\hibernate\InterceptableSessionFactory.java:40:
> com.infusi
> on.util.domain.event.hibernate.InterceptableSessionFactory is not abstract
> and d
> oes not override abstract method getSecondLevelCacheRegion(java.lang.String)
> in
> org.hibernate.engine.SessionFactoryImplementor
> public class InterceptableSessionFactory implements SessionFactory ,
> SessionFact
> oryImplementor{
>       ^
> e:\project\plugins\falcone-util-1.0\src\java\com\infu
> sion\util\domain\event\hibernate\InterceptableSessionFactory.java:265:
> getSecond
> LevelCacheRegion(java.lang.String) in
> com.infusion.util.domain.event.hibernate.I
> nterceptableSessionFactory cannot implement
> getSecondLevelCacheRegion(java.lang.
> String) in org.hibernate.engine.SessionFactoryImplementor; attempting to use
> inc
> ompatible return type
> found   : org.hibernate.cache.Region
> required: org.hibernate.cache.Cache
>    public Region getSecondLevelCacheRegion(String regionName) {
>                  ^
> e:\project\plugins\falcone-util-1.0\src\java\com\infu
> sion\util\domain\event\hibernate\InterceptableSessionFactory.java:266:
> incompati
> ble types
> found   : org.hibernate.cache.Cache
> required: org.hibernate.cache.Region
>        return implementor.getSecondLevelCacheRegion(regionName);
>                                                    ^
> e:\project\plugins\falcone-util-1.0\src\java\util\Tre
> eKey.java:18: warning: sun.misc.ASCIICaseInsensitiveComparator is Sun
> proprietar
> y API and may be removed in a future release
>    private static final Comparator STRING_COMPARATOR = new
> ASCIICaseInsensitive
> Comparator();
>                                                            ^
> Note: Some input files use or override a deprecated API.
> Note: Recompile with -Xlint:deprecation for details.
> Note: Some input files use unchecked or unsafe operations.
> Note: Recompile with -Xlint:unchecked for details.
> 7 errors
> 2 warnings
>
>
> 1 error
>
>        at
> org.codehaus.groovy.control.ErrorCollector.failIfErrors(ErrorCollecto
> r.java:302)
>        at
> org.codehaus.groovy.control.ErrorCollector.addFatalError(ErrorCollect
> or.java:149)
>        at
> org.codehaus.groovy.tools.javac.JavacJavaCompiler.addJavacError(Javac
> JavaCompiler.java:92)
>        at
> org.codehaus.groovy.tools.javac.JavacJavaCompiler.compile(JavacJavaCo
> mpiler.java:71)
>        at
> org.codehaus.groovy.tools.javac.JavaAwareCompilationUnit.gotoPhase(Ja
> vaAwareCompilationUnit.java:94)
>        at
> org.codehaus.groovy.control.CompilationUnit.compile(CompilationUnit.j
> ava:484)
>        at
> org.codehaus.groovy.control.CompilationUnit.compile(CompilationUnit.j
> ava:453)
>        at
> org.codehaus.groovy.tools.FileSystemCompiler.compile(FileSystemCompil
> er.java:67)
>        at
> org.codehaus.groovy.tools.FileSystemCompiler.doCompilation(FileSystem
> Compiler.java:180)
>        at org.codehaus.groovy.ant.Groovyc.compile(Groovyc.java:905)
>        ... 26 more
> --- Nested Exception ---
> org.codehaus.groovy.control.MultipleCompilationErrorsException: startup
> failed:
> Compile error during compilation with javac.
> e:\project\plugins\falcone-util-1.0\src\java\util\Tre
> eKey.java:3: warning: sun.misc.ASCIICaseInsensitiveComparator is Sun
> proprietary
> API and may be removed in a future release
> import sun.misc.ASCIICaseInsensitiveComparator;
>               ^
> e:\project\plugins\falcone-util-1.0\src\java\com\infu
> sion\util\domain\event\HibernateEventAdapter.java:143: cannot find symbol
> symbol  : method
> handleEvent(java.lang.Object,org.hibernate.event.PreDeleteEvent
> ,java.lang.String)
> location: class com.infusion.util.domain.event.HibernateEventAdapter
>        return handleEvent(preDeleteEvent.getEntity(), preDeleteEvent,
> "preDelet
> e");
>               ^
> e:\project\plugins\falcone-util-1.0\src\java\com\infu
> sion\util\domain\event\HibernateEventAdapter.java:147: cannot find symbol
> symbol  : method
> handleEvent(java.lang.Object,org.hibernate.event.PreInsertEvent
> ,java.lang.String)
> location: class com.infusion.util.domain.event.HibernateEventAdapter
>        return handleEvent(preInsertEvent.getEntity(), preInsertEvent,
> "preInser
> t");
>               ^
> e:\project\plugins\falcone-util-1.0\src\java\com\infu
> sion\util\domain\event\HibernateEventAdapter.java:155: cannot find symbol
> symbol  : method
> handleEvent(java.lang.Object,org.hibernate.event.PreUpdateEvent
> ,java.lang.String)
> location: class com.infusion.util.domain.event.HibernateEventAdapter
>        return handleEvent(preUpdateEvent.getEntity(), preUpdateEvent,
> "preUpdat
> e");
>               ^
> e:\project\plugins\falcone-util-1.0\src\java\com\infu
> sion\util\domain\event\hibernate\InterceptableSession.java:71: cannot find
> symbo
> l
> symbol  : method doWork(org.hibernate.jdbc.Work)
> location: interface org.hibernate.classic.Session
>        session.doWork(work);
>               ^
> e:\project\plugins\falcone-util-1.0\src\java\com\infu
> sion\util\domain\event\hibernate\InterceptableSessionFactory.java:40:
> com.infusi
> on.util.domain.event.hibernate.InterceptableSessionFactory is not abstract
> and d
> oes not override abstract method getSecondLevelCacheRegion(java.lang.String)
> in
> org.hibernate.engine.SessionFactoryImplementor
> public class InterceptableSessionFactory implements SessionFactory ,
> SessionFact
> oryImplementor{
>       ^
> e:\project\plugins\falcone-util-1.0\src\java\com\infu
> sion\util\domain\event\hibernate\InterceptableSessionFactory.java:265:
> getSecond
> LevelCacheRegion(java.lang.String) in
> com.infusion.util.domain.event.hibernate.I
> nterceptableSessionFactory cannot implement
> getSecondLevelCacheRegion(java.lang.
> String) in org.hibernate.engine.SessionFactoryImplementor; attempting to use
> inc
> ompatible return type
> found   : org.hibernate.cache.Region
> required: org.hibernate.cache.Cache
>    public Region getSecondLevelCacheRegion(String regionName) {
>                  ^
> e:\project\plugins\falcone-util-1.0\src\java\com\infu
> sion\util\domain\event\hibernate\InterceptableSessionFactory.java:266:
> incompati
> ble types
> found   : org.hibernate.cache.Cache
> required: org.hibernate.cache.Region
>        return implementor.getSecondLevelCacheRegion(regionName);
>                                                    ^
> e:\project\plugins\falcone-util-1.0\src\java\util\Tre
> eKey.java:18: warning: sun.misc.ASCIICaseInsensitiveComparator is Sun
> proprietar
> y API and may be removed in a future release
>    private static final Comparator STRING_COMPARATOR = new
> ASCIICaseInsensitive
> Comparator();
>                                                            ^
> Note: Some input files use or override a deprecated API.
> Note: Recompile with -Xlint:deprecation for details.
> Note: Some input files use unchecked or unsafe operations.
> Note: Recompile with -Xlint:unchecked for details.
> 7 errors
> 2 warnings
>
>
> 1 error
>
>        at
> org.codehaus.groovy.control.ErrorCollector.failIfErrors(ErrorCollecto
> r.java:302)
>        at
> org.codehaus.groovy.control.ErrorCollector.addFatalError(ErrorCollect
> or.java:149)
>        at
> org.codehaus.groovy.tools.javac.JavacJavaCompiler.addJavacError(Javac
> JavaCompiler.java:92)
>        at
> org.codehaus.groovy.tools.javac.JavacJavaCompiler.compile(JavacJavaCo
> mpiler.java:71)
>        at
> org.codehaus.groovy.tools.javac.JavaAwareCompilationUnit.gotoPhase(Ja
> vaAwareCompilationUnit.java:94)
>        at
> org.codehaus.groovy.control.CompilationUnit.compile(CompilationUnit.j
> ava:484)
>        at
> org.codehaus.groovy.control.CompilationUnit.compile(CompilationUnit.j
> ava:453)
>        at
> org.codehaus.groovy.tools.FileSystemCompiler.compile(FileSystemCompil
> er.java:67)
>        at
> org.codehaus.groovy.tools.FileSystemCompiler.doCompilation(FileSystem
> Compiler.java:180)
>        at org.codehaus.groovy.ant.Groovyc.compile(Groovyc.java:905)
>        at org.codehaus.groovy.ant.Groovyc.execute(Groovyc.java:607)
>        at
> org.apache.tools.ant.UnknownElement.execute(UnknownElement.java:288)
>        at
> org.apache.tools.ant.dispatch.DispatchUtils.execute(DispatchUtils.jav
> a:106)
>        at
> _GrailsCompile_groovy$_run_closure4_closure10.doCall(_GrailsCompile_g
> roovy:117)
>        at
> _GrailsCompile_groovy$_run_closure4_closure10.doCall(_GrailsCompile_g
> roovy)
>        at
> _GrailsSettings_groovy$_run_closure10.doCall(_GrailsSettings_groovy:2
> 80)
>        at
> _GrailsSettings_groovy$_run_closure10.call(_GrailsSettings_groovy)
>        at
> _GrailsCompile_groovy$_run_closure4.doCall(_GrailsCompile_groovy:104)
>
>        at
> _GrailsCompile_groovy$_run_closure3.doCall(_GrailsCompile_groovy:69)
>        at
> _GrailsPackage_groovy$_run_closure2_closure9.doCall(_GrailsPackage_gr
> oovy:85)
>        at
> _GrailsPackage_groovy$_run_closure2_closure9.doCall(_GrailsPackage_gr
> oovy)
>        at
> _GrailsSettings_groovy$_run_closure10.doCall(_GrailsSettings_groovy:2
> 80)
>        at
> _GrailsSettings_groovy$_run_closure10.call(_GrailsSettings_groovy)
>        at
> _GrailsPackage_groovy$_run_closure2.doCall(_GrailsPackage_groovy:84)
>        at RunApp$_run_closure1.doCall(RunApp.groovy:28)
>        at gant.Gant$_dispatch_closure5.doCall(Gant.groovy:381)
>        at gant.Gant$_dispatch_closure7.doCall(Gant.groovy:415)
>        at gant.Gant$_dispatch_closure7.doCall(Gant.groovy)
>        at gant.Gant.withBuildListeners(Gant.groovy:427)
>        at gant.Gant.this$2$withBuildListeners(Gant.groovy)
>        at gant.Gant$this$2$withBuildListeners.callCurrent(Unknown Source)
>        at gant.Gant.dispatch(Gant.groovy:415)
>        at gant.Gant.this$2$dispatch(Gant.groovy)
>        at gant.Gant.invokeMethod(Gant.groovy)
>        at gant.Gant.executeTargets(Gant.groovy:590)
>        at gant.Gant.executeTargets(Gant.groovy:589)
> Compilation error: Compilation Failed
> e:\project>
> --
> View this message in context: http://grails.1312388.n4.nabble.com/grails-1-3-7-and-multi-tenant-tp3309836p3309836.html
> Sent from the Grails - user mailing list archive at Nabble.com.
>
> ---------------------------------------------------------------------
> To unsubscribe from this list, please visit:
>
>    http://xircles.codehaus.org/manage_email
>
>


---------------------------------------------------------------------
To unsubscribe from this list, please visit:

    http://xircles.codehaus.org/manage_email


Reply | Threaded
Open this post in threaded view
|

Re: grails 1.3.7 and multi-tenant

Graeme Rocher
Administrator
I tried a simple test with 1.3.7 of

grails create-app foobar
cd foobar
grails install-plugin multi-tenant-core
grails compile

And got no compilation errors. Maybe something platform specific.

Please attach an example in a JIRA

Cheers

On Wed, Feb 16, 2011 at 11:14 PM, Scott Ryan <[hidden email]> wrote:

> 1.3.7 came out today and we are still testing the multi tenant plugin on it.  It will be a few days before we can finish the tests and release a version for 1.3.7
>
> 1.3.6 is the last version that it is supported on.
>
> Scott Ryan
>
> On Feb 16, 2011, at 3:06 PM, reset wrote:
>
>>
>> I'm got next compilation error with grails 1.3.7 and Multi-Tenant (Core)
>> 1.0.3 && falcone-util 1.0
>> With grails 1.3.5 all works fine.
>>
>> Please help me or give any ideas how to resolve this.
>>
>> A lot of thanks.
>>
>> roovy:117)
>>        at
>> _GrailsCompile_groovy$_run_closure4_closure10.doCall(_GrailsCompile_g
>> roovy)
>>        at
>> _GrailsSettings_groovy$_run_closure10.doCall(_GrailsSettings_groovy:2
>> 80)
>>        at
>> _GrailsSettings_groovy$_run_closure10.call(_GrailsSettings_groovy)
>>        at
>> _GrailsCompile_groovy$_run_closure4.doCall(_GrailsCompile_groovy:104)
>>
>>        at
>> _GrailsCompile_groovy$_run_closure3.doCall(_GrailsCompile_groovy:69)
>>        at
>> _GrailsPackage_groovy$_run_closure2_closure9.doCall(_GrailsPackage_gr
>> oovy:85)
>>        at
>> _GrailsPackage_groovy$_run_closure2_closure9.doCall(_GrailsPackage_gr
>> oovy)
>>        at
>> _GrailsSettings_groovy$_run_closure10.doCall(_GrailsSettings_groovy:2
>> 80)
>>        at
>> _GrailsSettings_groovy$_run_closure10.call(_GrailsSettings_groovy)
>>        at
>> _GrailsPackage_groovy$_run_closure2.doCall(_GrailsPackage_groovy:84)
>>        at RunApp$_run_closure1.doCall(RunApp.groovy:28)
>>        at gant.Gant$_dispatch_closure5.doCall(Gant.groovy:381)
>>        at gant.Gant$_dispatch_closure7.doCall(Gant.groovy:415)
>>        at gant.Gant$_dispatch_closure7.doCall(Gant.groovy)
>>        at gant.Gant.withBuildListeners(Gant.groovy:427)
>>        at gant.Gant.this$2$withBuildListeners(Gant.groovy)
>>        at gant.Gant$this$2$withBuildListeners.callCurrent(Unknown Source)
>>        at gant.Gant.dispatch(Gant.groovy:415)
>>        at gant.Gant.this$2$dispatch(Gant.groovy)
>>        at gant.Gant.invokeMethod(Gant.groovy)
>>        at gant.Gant.executeTargets(Gant.groovy:590)
>>        at gant.Gant.executeTargets(Gant.groovy:589)
>> : Compilation Failed
>>        at org.codehaus.groovy.ant.Groovyc.compile(Groovyc.java:920)
>>        at org.codehaus.groovy.ant.Groovyc.execute(Groovyc.java:607)
>>        at
>> org.apache.tools.ant.UnknownElement.execute(UnknownElement.java:288)
>>        at
>> org.apache.tools.ant.dispatch.DispatchUtils.execute(DispatchUtils.jav
>> a:106)
>>        at
>> _GrailsCompile_groovy$_run_closure4_closure10.doCall(_GrailsCompile_g
>> roovy:117)
>>        at
>> _GrailsCompile_groovy$_run_closure4_closure10.doCall(_GrailsCompile_g
>> roovy)
>>        at
>> _GrailsSettings_groovy$_run_closure10.doCall(_GrailsSettings_groovy:2
>> 80)
>>        at
>> _GrailsSettings_groovy$_run_closure10.call(_GrailsSettings_groovy)
>>        at
>> _GrailsCompile_groovy$_run_closure4.doCall(_GrailsCompile_groovy:104)
>>
>>        at
>> _GrailsCompile_groovy$_run_closure3.doCall(_GrailsCompile_groovy:69)
>>        at
>> _GrailsPackage_groovy$_run_closure2_closure9.doCall(_GrailsPackage_gr
>> oovy:85)
>>        at
>> _GrailsPackage_groovy$_run_closure2_closure9.doCall(_GrailsPackage_gr
>> oovy)
>>        at
>> _GrailsSettings_groovy$_run_closure10.doCall(_GrailsSettings_groovy:2
>> 80)
>>        at
>> _GrailsSettings_groovy$_run_closure10.call(_GrailsSettings_groovy)
>>        at
>> _GrailsPackage_groovy$_run_closure2.doCall(_GrailsPackage_groovy:84)
>>        at RunApp$_run_closure1.doCall(RunApp.groovy:28)
>>        at gant.Gant$_dispatch_closure5.doCall(Gant.groovy:381)
>>        at gant.Gant$_dispatch_closure7.doCall(Gant.groovy:415)
>>        at gant.Gant$_dispatch_closure7.doCall(Gant.groovy)
>>        at gant.Gant.withBuildListeners(Gant.groovy:427)
>>        at gant.Gant.this$2$withBuildListeners(Gant.groovy)
>>        at gant.Gant$this$2$withBuildListeners.callCurrent(Unknown Source)
>>        at gant.Gant.dispatch(Gant.groovy:415)
>>        at gant.Gant.this$2$dispatch(Gant.groovy)
>>        at gant.Gant.invokeMethod(Gant.groovy)
>>        at gant.Gant.executeTargets(Gant.groovy:590)
>>        at gant.Gant.executeTargets(Gant.groovy:589)
>> Caused by: org.codehaus.groovy.control.MultipleCompilationErrorsException:
>> start
>> up failed:
>> Compile error during compilation with javac.
>> e:\project\plugins\falcone-util-1.0\src\java\util\Tre
>> eKey.java:3: warning: sun.misc.ASCIICaseInsensitiveComparator is Sun
>> proprietary
>> API and may be removed in a future release
>> import sun.misc.ASCIICaseInsensitiveComparator;
>>               ^
>> e:\project\plugins\falcone-util-1.0\src\java\com\infu
>> sion\util\domain\event\HibernateEventAdapter.java:143: cannot find symbol
>> symbol  : method
>> handleEvent(java.lang.Object,org.hibernate.event.PreDeleteEvent
>> ,java.lang.String)
>> location: class com.infusion.util.domain.event.HibernateEventAdapter
>>        return handleEvent(preDeleteEvent.getEntity(), preDeleteEvent,
>> "preDelet
>> e");
>>               ^
>> e:\project\plugins\falcone-util-1.0\src\java\com\infu
>> sion\util\domain\event\HibernateEventAdapter.java:147: cannot find symbol
>> symbol  : method
>> handleEvent(java.lang.Object,org.hibernate.event.PreInsertEvent
>> ,java.lang.String)
>> location: class com.infusion.util.domain.event.HibernateEventAdapter
>>        return handleEvent(preInsertEvent.getEntity(), preInsertEvent,
>> "preInser
>> t");
>>               ^
>> e:\project\plugins\falcone-util-1.0\src\java\com\infu
>> sion\util\domain\event\HibernateEventAdapter.java:155: cannot find symbol
>> symbol  : method
>> handleEvent(java.lang.Object,org.hibernate.event.PreUpdateEvent
>> ,java.lang.String)
>> location: class com.infusion.util.domain.event.HibernateEventAdapter
>>        return handleEvent(preUpdateEvent.getEntity(), preUpdateEvent,
>> "preUpdat
>> e");
>>               ^
>> e:\project\plugins\falcone-util-1.0\src\java\com\infu
>> sion\util\domain\event\hibernate\InterceptableSession.java:71: cannot find
>> symbo
>> l
>> symbol  : method doWork(org.hibernate.jdbc.Work)
>> location: interface org.hibernate.classic.Session
>>        session.doWork(work);
>>               ^
>> e:\project\plugins\falcone-util-1.0\src\java\com\infu
>> sion\util\domain\event\hibernate\InterceptableSessionFactory.java:40:
>> com.infusi
>> on.util.domain.event.hibernate.InterceptableSessionFactory is not abstract
>> and d
>> oes not override abstract method getSecondLevelCacheRegion(java.lang.String)
>> in
>> org.hibernate.engine.SessionFactoryImplementor
>> public class InterceptableSessionFactory implements SessionFactory ,
>> SessionFact
>> oryImplementor{
>>       ^
>> e:\project\plugins\falcone-util-1.0\src\java\com\infu
>> sion\util\domain\event\hibernate\InterceptableSessionFactory.java:265:
>> getSecond
>> LevelCacheRegion(java.lang.String) in
>> com.infusion.util.domain.event.hibernate.I
>> nterceptableSessionFactory cannot implement
>> getSecondLevelCacheRegion(java.lang.
>> String) in org.hibernate.engine.SessionFactoryImplementor; attempting to use
>> inc
>> ompatible return type
>> found   : org.hibernate.cache.Region
>> required: org.hibernate.cache.Cache
>>    public Region getSecondLevelCacheRegion(String regionName) {
>>                  ^
>> e:\project\plugins\falcone-util-1.0\src\java\com\infu
>> sion\util\domain\event\hibernate\InterceptableSessionFactory.java:266:
>> incompati
>> ble types
>> found   : org.hibernate.cache.Cache
>> required: org.hibernate.cache.Region
>>        return implementor.getSecondLevelCacheRegion(regionName);
>>                                                    ^
>> e:\project\plugins\falcone-util-1.0\src\java\util\Tre
>> eKey.java:18: warning: sun.misc.ASCIICaseInsensitiveComparator is Sun
>> proprietar
>> y API and may be removed in a future release
>>    private static final Comparator STRING_COMPARATOR = new
>> ASCIICaseInsensitive
>> Comparator();
>>                                                            ^
>> Note: Some input files use or override a deprecated API.
>> Note: Recompile with -Xlint:deprecation for details.
>> Note: Some input files use unchecked or unsafe operations.
>> Note: Recompile with -Xlint:unchecked for details.
>> 7 errors
>> 2 warnings
>>
>>
>> 1 error
>>
>>        at
>> org.codehaus.groovy.control.ErrorCollector.failIfErrors(ErrorCollecto
>> r.java:302)
>>        at
>> org.codehaus.groovy.control.ErrorCollector.addFatalError(ErrorCollect
>> or.java:149)
>>        at
>> org.codehaus.groovy.tools.javac.JavacJavaCompiler.addJavacError(Javac
>> JavaCompiler.java:92)
>>        at
>> org.codehaus.groovy.tools.javac.JavacJavaCompiler.compile(JavacJavaCo
>> mpiler.java:71)
>>        at
>> org.codehaus.groovy.tools.javac.JavaAwareCompilationUnit.gotoPhase(Ja
>> vaAwareCompilationUnit.java:94)
>>        at
>> org.codehaus.groovy.control.CompilationUnit.compile(CompilationUnit.j
>> ava:484)
>>        at
>> org.codehaus.groovy.control.CompilationUnit.compile(CompilationUnit.j
>> ava:453)
>>        at
>> org.codehaus.groovy.tools.FileSystemCompiler.compile(FileSystemCompil
>> er.java:67)
>>        at
>> org.codehaus.groovy.tools.FileSystemCompiler.doCompilation(FileSystem
>> Compiler.java:180)
>>        at org.codehaus.groovy.ant.Groovyc.compile(Groovyc.java:905)
>>        ... 26 more
>> --- Nested Exception ---
>> org.codehaus.groovy.control.MultipleCompilationErrorsException: startup
>> failed:
>> Compile error during compilation with javac.
>> e:\project\plugins\falcone-util-1.0\src\java\util\Tre
>> eKey.java:3: warning: sun.misc.ASCIICaseInsensitiveComparator is Sun
>> proprietary
>> API and may be removed in a future release
>> import sun.misc.ASCIICaseInsensitiveComparator;
>>               ^
>> e:\project\plugins\falcone-util-1.0\src\java\com\infu
>> sion\util\domain\event\HibernateEventAdapter.java:143: cannot find symbol
>> symbol  : method
>> handleEvent(java.lang.Object,org.hibernate.event.PreDeleteEvent
>> ,java.lang.String)
>> location: class com.infusion.util.domain.event.HibernateEventAdapter
>>        return handleEvent(preDeleteEvent.getEntity(), preDeleteEvent,
>> "preDelet
>> e");
>>               ^
>> e:\project\plugins\falcone-util-1.0\src\java\com\infu
>> sion\util\domain\event\HibernateEventAdapter.java:147: cannot find symbol
>> symbol  : method
>> handleEvent(java.lang.Object,org.hibernate.event.PreInsertEvent
>> ,java.lang.String)
>> location: class com.infusion.util.domain.event.HibernateEventAdapter
>>        return handleEvent(preInsertEvent.getEntity(), preInsertEvent,
>> "preInser
>> t");
>>               ^
>> e:\project\plugins\falcone-util-1.0\src\java\com\infu
>> sion\util\domain\event\HibernateEventAdapter.java:155: cannot find symbol
>> symbol  : method
>> handleEvent(java.lang.Object,org.hibernate.event.PreUpdateEvent
>> ,java.lang.String)
>> location: class com.infusion.util.domain.event.HibernateEventAdapter
>>        return handleEvent(preUpdateEvent.getEntity(), preUpdateEvent,
>> "preUpdat
>> e");
>>               ^
>> e:\project\plugins\falcone-util-1.0\src\java\com\infu
>> sion\util\domain\event\hibernate\InterceptableSession.java:71: cannot find
>> symbo
>> l
>> symbol  : method doWork(org.hibernate.jdbc.Work)
>> location: interface org.hibernate.classic.Session
>>        session.doWork(work);
>>               ^
>> e:\project\plugins\falcone-util-1.0\src\java\com\infu
>> sion\util\domain\event\hibernate\InterceptableSessionFactory.java:40:
>> com.infusi
>> on.util.domain.event.hibernate.InterceptableSessionFactory is not abstract
>> and d
>> oes not override abstract method getSecondLevelCacheRegion(java.lang.String)
>> in
>> org.hibernate.engine.SessionFactoryImplementor
>> public class InterceptableSessionFactory implements SessionFactory ,
>> SessionFact
>> oryImplementor{
>>       ^
>> e:\project\plugins\falcone-util-1.0\src\java\com\infu
>> sion\util\domain\event\hibernate\InterceptableSessionFactory.java:265:
>> getSecond
>> LevelCacheRegion(java.lang.String) in
>> com.infusion.util.domain.event.hibernate.I
>> nterceptableSessionFactory cannot implement
>> getSecondLevelCacheRegion(java.lang.
>> String) in org.hibernate.engine.SessionFactoryImplementor; attempting to use
>> inc
>> ompatible return type
>> found   : org.hibernate.cache.Region
>> required: org.hibernate.cache.Cache
>>    public Region getSecondLevelCacheRegion(String regionName) {
>>                  ^
>> e:\project\plugins\falcone-util-1.0\src\java\com\infu
>> sion\util\domain\event\hibernate\InterceptableSessionFactory.java:266:
>> incompati
>> ble types
>> found   : org.hibernate.cache.Cache
>> required: org.hibernate.cache.Region
>>        return implementor.getSecondLevelCacheRegion(regionName);
>>                                                    ^
>> e:\project\plugins\falcone-util-1.0\src\java\util\Tre
>> eKey.java:18: warning: sun.misc.ASCIICaseInsensitiveComparator is Sun
>> proprietar
>> y API and may be removed in a future release
>>    private static final Comparator STRING_COMPARATOR = new
>> ASCIICaseInsensitive
>> Comparator();
>>                                                            ^
>> Note: Some input files use or override a deprecated API.
>> Note: Recompile with -Xlint:deprecation for details.
>> Note: Some input files use unchecked or unsafe operations.
>> Note: Recompile with -Xlint:unchecked for details.
>> 7 errors
>> 2 warnings
>>
>>
>> 1 error
>>
>>        at
>> org.codehaus.groovy.control.ErrorCollector.failIfErrors(ErrorCollecto
>> r.java:302)
>>        at
>> org.codehaus.groovy.control.ErrorCollector.addFatalError(ErrorCollect
>> or.java:149)
>>        at
>> org.codehaus.groovy.tools.javac.JavacJavaCompiler.addJavacError(Javac
>> JavaCompiler.java:92)
>>        at
>> org.codehaus.groovy.tools.javac.JavacJavaCompiler.compile(JavacJavaCo
>> mpiler.java:71)
>>        at
>> org.codehaus.groovy.tools.javac.JavaAwareCompilationUnit.gotoPhase(Ja
>> vaAwareCompilationUnit.java:94)
>>        at
>> org.codehaus.groovy.control.CompilationUnit.compile(CompilationUnit.j
>> ava:484)
>>        at
>> org.codehaus.groovy.control.CompilationUnit.compile(CompilationUnit.j
>> ava:453)
>>        at
>> org.codehaus.groovy.tools.FileSystemCompiler.compile(FileSystemCompil
>> er.java:67)
>>        at
>> org.codehaus.groovy.tools.FileSystemCompiler.doCompilation(FileSystem
>> Compiler.java:180)
>>        at org.codehaus.groovy.ant.Groovyc.compile(Groovyc.java:905)
>>        at org.codehaus.groovy.ant.Groovyc.execute(Groovyc.java:607)
>>        at
>> org.apache.tools.ant.UnknownElement.execute(UnknownElement.java:288)
>>        at
>> org.apache.tools.ant.dispatch.DispatchUtils.execute(DispatchUtils.jav
>> a:106)
>>        at
>> _GrailsCompile_groovy$_run_closure4_closure10.doCall(_GrailsCompile_g
>> roovy:117)
>>        at
>> _GrailsCompile_groovy$_run_closure4_closure10.doCall(_GrailsCompile_g
>> roovy)
>>        at
>> _GrailsSettings_groovy$_run_closure10.doCall(_GrailsSettings_groovy:2
>> 80)
>>        at
>> _GrailsSettings_groovy$_run_closure10.call(_GrailsSettings_groovy)
>>        at
>> _GrailsCompile_groovy$_run_closure4.doCall(_GrailsCompile_groovy:104)
>>
>>        at
>> _GrailsCompile_groovy$_run_closure3.doCall(_GrailsCompile_groovy:69)
>>        at
>> _GrailsPackage_groovy$_run_closure2_closure9.doCall(_GrailsPackage_gr
>> oovy:85)
>>        at
>> _GrailsPackage_groovy$_run_closure2_closure9.doCall(_GrailsPackage_gr
>> oovy)
>>        at
>> _GrailsSettings_groovy$_run_closure10.doCall(_GrailsSettings_groovy:2
>> 80)
>>        at
>> _GrailsSettings_groovy$_run_closure10.call(_GrailsSettings_groovy)
>>        at
>> _GrailsPackage_groovy$_run_closure2.doCall(_GrailsPackage_groovy:84)
>>        at RunApp$_run_closure1.doCall(RunApp.groovy:28)
>>        at gant.Gant$_dispatch_closure5.doCall(Gant.groovy:381)
>>        at gant.Gant$_dispatch_closure7.doCall(Gant.groovy:415)
>>        at gant.Gant$_dispatch_closure7.doCall(Gant.groovy)
>>        at gant.Gant.withBuildListeners(Gant.groovy:427)
>>        at gant.Gant.this$2$withBuildListeners(Gant.groovy)
>>        at gant.Gant$this$2$withBuildListeners.callCurrent(Unknown Source)
>>        at gant.Gant.dispatch(Gant.groovy:415)
>>        at gant.Gant.this$2$dispatch(Gant.groovy)
>>        at gant.Gant.invokeMethod(Gant.groovy)
>>        at gant.Gant.executeTargets(Gant.groovy:590)
>>        at gant.Gant.executeTargets(Gant.groovy:589)
>> Compilation error: Compilation Failed
>> e:\project>
>> --
>> View this message in context: http://grails.1312388.n4.nabble.com/grails-1-3-7-and-multi-tenant-tp3309836p3309836.html
>> Sent from the Grails - user mailing list archive at Nabble.com.
>>
>> ---------------------------------------------------------------------
>> To unsubscribe from this list, please visit:
>>
>>    http://xircles.codehaus.org/manage_email
>>
>>
>
>
> ---------------------------------------------------------------------
> To unsubscribe from this list, please visit:
>
>    http://xircles.codehaus.org/manage_email
>
>
>



--
Graeme Rocher
Grails Project Lead
SpringSource - A Division of VMware
http://www.springsource.com

---------------------------------------------------------------------
To unsubscribe from this list, please visit:

    http://xircles.codehaus.org/manage_email


Reply | Threaded
Open this post in threaded view
|

Re: grails 1.3.7 and multi-tenant

reset
Thanks for quick answers.

Seems like we in right direction :)

Yes you are right, clean project(foobar) work without problems. But when i'm add pom=true to BuildConfig.groovy and pom.xml to project, got same compilation problem again.

Looks like problem was in dependency.
 <dependency>
            <groupId>org.hibernate</groupId>
            <artifactId>hibernate</artifactId>
            <version>3.2.7.ga</version>
            <exclusions>
                <exclusion>
                    <groupId>asm</groupId>
                    <artifactId>asm</artifactId>
                </exclusion>
                <exclusion>
                    <groupId>asm</groupId>
                    <artifactId>asm-attrs</artifactId>
                </exclusion>
                <exclusion>
                    <groupId>cglib</groupId>
                    <artifactId>cglib</artifactId>
                </exclusion>
            </exclusions>
        </dependency>
Reply | Threaded
Open this post in threaded view
|

Re: grails 1.3.7 and multi-tenant

skurt
Any news on this? is multi-tenant working with 1.3.7 or even better did
someone mange to get it working with 1.4.0.M1?

sebastian

Am 17.02.2011 00:32, schrieb reset:

>
> Thanks for quick answers.
>
> Seems like we in right direction :)
>
> Yes you are right, clean project(foobar) work without problems. But when i'm
> add pom=true to BuildConfig.groovy and pom.xml to project, got same
> compilation problem again.
>
> Looks like problem was in dependency.
>   <dependency>
>              <groupId>org.hibernate</groupId>
>              <artifactId>hibernate</artifactId>
>              <version>3.2.7.ga</version>
>              <exclusions>
>                  <exclusion>
>                      <groupId>asm</groupId>
>                      <artifactId>asm</artifactId>
>                  </exclusion>
>                  <exclusion>
>                      <groupId>asm</groupId>
>                      <artifactId>asm-attrs</artifactId>
>                  </exclusion>
>                  <exclusion>
>                      <groupId>cglib</groupId>
>                      <artifactId>cglib</artifactId>
>                  </exclusion>
>              </exclusions>
>          </dependency>
>

--
Geschäftsführer (CEO)

Shopotainment by
Haiku Internet GmbH
Schlegelstraße 26
10115 Berlin

Tel.: +49 30 868702020
Fax: +49 30 57708224
Mobil: +49 179 7923088
E-Mail: [hidden email]
http://www.shopotainment.de
http://facebook.com/shopotainment
http://twitter.com/shopotainment

Handelsregister: HRB 126354 B
Amtsgericht Berlin-Charlottenburg
Geschäftsführung:
Adrian Haß, Sebastian Kurt

---------------------------------------------------------------------
To unsubscribe from this list, please visit:

    http://xircles.codehaus.org/manage_email


Reply | Threaded
Open this post in threaded view
|

Re: grails 1.3.7 and multi-tenant

reset
working well with 1.3.7